{"text_format":"1","workbook":"xlsx","n_sheets":19,"sheets":["Table of Contents","Survey","HVAC SCOPE","EF SCOPE","RTU1","RTU2","RTU3","RTU4","RTU5","RTU6","RTU7","RTU8","EF Thermostat","RUSCOMP","MASTER SCOPES","SYNEXIS","IECC ","Store Data","Drop Menus"],"not_rendered":{"charts":0,"images":2,"macros":1,"external_links":4,"defined_names":4,"comments":0,"pivot_tables":0},"unopened":[],"bounds":{"document_bytes":16777216,"sheet_cells":100000,"rows_first":2000,"rows_last":500,"rows_between":2000,"halvings":0,"cell_chars":16384,"cell_head_chars":4096},"cells_cut":0,"cells_raw":0,"read":"whole","date_system":"1900"}

{"sheet":"Table of Contents","index":0,"n_rows":43,"n_cols":14,"rows_kept":43,"cut":false,"hidden":true,"merged":[[37,1,37,12],[38,1,38,8],[39,1,39,12],[40,1,40,8],[21,1,21,8],[22,1,22,8],[27,1,27,8],[28,1,28,8],[29,1,29,8],[30,1,30,8],[23,1,23,8],[24,1,24,8],[26,1,26,8],[25,1,25,12],[36,1,36,8],[35,1,35,12],[0,1,0,12],[1,1,1,12],[13,1,13,8],[14,1,14,8],[15,1,15,12],[2,1,2,8],[3,1,3,12],[10,1,10,12],[11,1,11,8],[12,1,12,8],[8,1,8,8],[4,1,4,8],[6,1,6,8],[7,1,7,8],[5,1,5,8],[33,1,33,12],[34,1,34,8],[9,1,9,8],[19,1,19,8],[20,1,20,12],[18,1,18,8],[16,1,16,12],[17,1,17,8],[31,1,31,12],[32,1,32,8]]}
[null,"STRATEGIC REINVESTMENT CONDITION SURVEY"]
[null,"TABLE OF CONTENTS"]
[null,"ROW DESCRIPTION",null,null,null,null,null,null,null,"IDENT./INFO. CELLS","INPUT CELLS","REFERENCED CELLS","# OF CODED LOGIC CELLS"]
[null,"SURVEY WORKSHEET  "]
[null,"1.  Rows one thru five contain the unit information, TAB Partner, TAB Technician, CSD, survey due date and reinvestment contacts.",null,null,null,null,null,null,null,23,0,20,0]
[null,"2.  Row six SYNEXUS status ie. active/inactive/not installed.",null,null,null,null,null,null,null,1,0,0,1]
[null,"3.  Rows seven thru fifteen contain the RTU's serial/model numbers, tonnage, manufacturer,  type, age, area served and replacement cost for heat exchanger, condenser, evaporator, power exhaust and hail gurad.",null,null,null,null,null,null,null,23,0,32,72]
[null,"4.  Rows sixteen thru fifty-nine contain the twenty-two components to check in order to assess the condition of the RTU units.  Also the answers to these questions are recorded in these rows, and come from RTU1 thru RTU8 worksheets",null,null,null,null,null,null,null,198,0,176,0]
[null,"5.  Rows sixty thru seventy-three contain eight questions related to the rooftop exhaust fans and RTU thermostats.  Also the answers to these questions are recorded in these rows.  The answers come from the EF Thermostat worksheet.",null,null,null,null,null,null,null,28,0,26,0]
[null,"6.  Rows seventy-four thru ninty-six contain cell area for any issues found that are not identified in the twenty-two questions.",null,null,null,null,null,null,null,10,0,27,0]
[null,"HVAC SCOPE WORKSHEET"]
[null,"1.  Rows one thru eight contain the RTU#, model #'S, serial #'s, RTU manufacturer, RTU type, tonnage, age, IECC zone, area served, unit life and RTU life percentage.",null,null,null,null,null,null,null,15,0,14,2]
[null,"2.  Row nine states the replacement guidelines for the mechanical contractor to follow for the condenser and evaporator coils.",null,null,null,null,null,null,null,1,0,0,0]
[null,"3.  Rows ten thru thirty-two contain the components to check, the response and  scope of work for up to eight RTU units to follow.",null,null,null,null,null,null,null,184,0,184,184]
[null,"4.  Rows thirty-three thru thirty-six contain any miscelleneous component issues found that are not addressed in the stated component checks.",null,null,null,null,null,null,null,8,0,24,0]
[null,"EF SCOPE WORKSHEET"]
[]
[]
[]
[]
[null,"*ROOF TOP UNIT ONE (RTU1) THRU ROOFTOP UNIT EIGHT (RTU8) WORKSHEET"]
[null,"1.  Rows one thru five contain RTU1's manufactuer, type, model #, serial #, age and tonnage.",null,null,null,null,null,null,null,6,0,6,0]
[null,"2.  Rows six thru twenty-eight contain twenty-two RTU components to check, the code output and the findings.  The code output tells the field tech whether to check the RTU component or not.  If a N/A value is present, the component does not need to be checked.  This decision is determined by the age, tonnage and cabinet size of the unit.  ",null,null,null,null,null,null,null,9,22,6,21]
[null,"4.  Rows thirty-three thru thirty-six contain any miscelleneous component issues found that are not addressed in the stated compoent checks.",null,null,null,null,null,null,null,1,0,0,0]
[null,"*The RTU1 thru RTU8 worksheets are used in the field by the TAB field technicians.  All field data is captured in the \"findings\" column and miscellaneous notes area.  This information is transferred to the appropriate cells in the Survey and HVAC worksheets. "]
[null,"EXHAUST FANS/SUNCOAST PANEL/THERMOSTAT WORKSHEET"]
[null,"1.  Rows three thru nine contain three exhaust fan components to check to asses the condition of the exhaust fans.",null,null,null,null,null,null,null,13,0,3,12]
[null,"2.  Rows ten and eleven checks the existence of a liner in the bathroom exhaust fan.",null,null,null,null,null,null,null,1,1,1,0]
[null,"3.  Rows twelve thru fifteen records the model #, serial # and the existence of a HES control panel.",null,null,null,null,null,null,null,1,3,3,0]
[null,"4.  Rows sixteen thru ninteen records the thermostat type installed (Robert Shaw or Network).",null,null,null,null,null,null,null,1,8,1,0]
[null,"4.  Rows twenty thru twenty-three contain any miscelleneous component issues found that are not addressed in the stated component checks.",null,null,null,null,null,null,null,1,3,0,0]
[null,"MASTER SCOPE WORKSHEET"]
[null,"This work sheet contains all the scopes of work informing the field consultant, mechanial contractor and strategic reinvestment what to do for the RTU's, exhaust fans and thermostats.  Note that it is a master sheet, and changes made to the individual scopes will be reflected in thee RTU's scope of work.",null,null,null,null,null,null,null,46,146,0,0]
[null,"SYNEXIS WORKSHEET"]
[null,"The SYNEXIS worksheet contains all the CFA units that has the SYNEXIS system installed and is active or installed and is inactive.  This status is shown in the survey as information to the reinvestment team.",null,null,null,null,null,null,null,834,0,0,0]
[null,"INTERNATIONAL ENERGY CONSERVATION CODE (IECC) WORKSHEET"]
[null,"The IECC worksheet contains all the counties in the US and their respective IECC Climate Zone number.  This number is shown in HVAC Scope worksheet, and is used to determine the expected life of the RTU unit.",null,null,null,null,null,null,null,19431,6470,0,0]
[null,"STORE DATA WORKSHEET"]
[null,"The Store Data worksheet contains the the unit information, TAB partner, construction start date, survey due date, construction manager, senior program manager, senior program lead, field consultant, architect, serial number, model number and RTU age for the specific CFA unit being surveyed.  This information is copy/pasted from a personal excel spreadsheet.",null,null,null,null,null,null,null,70,45,0,13]
[null,"DROP MENUS WORKSHEET"]
[null,"The Drop Menu worksheet contains list for generating drop down menus in the other worksheets."]
[]
[null,null,null,null,null,null,null,null,null,{"$f":"J5+J6+J7+J8+J9+J10+J12+J13+J14+J15+J22+J23+J24+J27+J28+J29+J30+J31+J33+J35+J37+J39","v":20905},{"$f":"K5+K6+K7+K8+K9+K10+K12+K13+K14+K15+K22+K23+K24+K27+K28+K29+K30+K31+K33+K35+K37+K39","v":6698},523,{"$f":"M5+M6+M7+M8+M9+M10+M12+M13+M14+M15+M22+M23+M24+M27+M28+M29+M30+M31+M33+M35+M37+M39+184","v":489},{"$f":"SUM(J43:M43)","v":28615}]

{"sheet":"Survey","index":1,"n_rows":279,"n_cols":95,"rows_kept":279,"cut":false,"hidden":false,"merged":[[65,1,65,66],[66,1,66,3],[66,4,66,6],[63,1,63,66],[64,1,64,3],[64,4,64,6],[64,7,64,9],[64,10,64,12],[64,13,64,15],[64,16,64,18],[64,19,64,21],[64,22,64,24],[64,25,64,66],[66,7,66,9],[66,10,66,12],[66,13,66,15],[66,16,66,18],[66,19,66,21],[66,22,66,24],[66,25,66,66],[62,1,62,3],[62,4,62,6],[62,7,62,9],[62,10,62,12],[62,13,62,15],[62,16,62,18],[62,19,62,21],[62,22,62,24],[62,25,62,66],[59,37,59,40],[59,41,59,44],[59,45,59,48],[59,49,59,52],[59,53,59,56],[59,57,59,60],[59,61,59,64],[57,1,57,4],[57,5,57,8],[59,1,59,4],[59,5,59,8],[59,9,59,12],[59,13,59,16],[59,17,59,20],[59,21,59,24],[59,25,59,28],[59,29,59,32],[59,33,59,36],[57,9,57,12],[57,13,57,16],[57,17,57,20],[57,21,57,24],[57,25,57,28],[57,29,57,32],[57,33,57,36],[53,37,53,40],[53,9,53,12],[53,13,53,16],[53,17,53,20],[53,21,53,24],[53,25,53,28],[53,29,53,32],[53,33,53,36],[57,37,57,40],[56,1,56,66],[54,1,54,66],[57,41,57,44],[57,45,57,48],[57,49,57,52],[57,53,57,56],[57,57,57,60],[57,61,57,64],[53,41,53,44],[53,45,53,48],[53,49,53,52],[53,53,53,56],[53,57,53,60],[53,61,53,64],[55,37,55,40],[55,41,55,44],[55,45,55,48],[55,49,55,52],[55,53,55,56],[55,57,55,60],[55,61,55,64],[53,1,53,4],[53,5,53,8],[55,1,55,4],[55,5,55,8],[55,9,55,12],[55,13,55,16],[55,17,55,20],[55,21,55,24],[55,25,55,28],[55,29,55,32],[55,33,55,36],[51,37,51,40],[51,41,51,44],[51,45,51,48],[51,49,51,52],[51,53,51,56],[51,57,51,60],[51,61,51,64],[49,1,49,4],[49,5,49,8],[49,9,49,12],[49,13,49,16],[49,17,49,20],[49,21,49,24],[49,25,49,28],[51,1,51,4],[51,5,51,8],[51,9,51,12],[51,13,51,16],[51,17,51,20],[51,21,51,24],[51,25,51,28],[51,29,51,32],[51,33,51,36],[49,29,49,32],[47,33,47,36],[46,1,46,66],[49,33,49,36],[45,57,45,60],[45,49,45,52],[45,53,45,56],[49,37,49,40],[49,41,49,44],[49,45,49,48],[49,49,49,52],[49,53,49,56],[49,57,49,60],[47,37,47,40],[47,41,47,44],[47,45,47,48],[47,49,47,52],[47,53,47,56],[47,57,47,60],[48,1,48,66],[49,61,49,64],[47,61,47,64],[45,21,45,24],[45,25,45,28],[45,29,45,32],[43,29,43,32],[43,33,43,36],[44,1,44,66],[45,41,45,44],[45,45,45,48],[45,37,45,40],[43,37,43,40],[43,41,43,44],[43,45,43,48],[43,49,43,52],[43,53,43,56],[43,57,43,60],[45,33,45,36],[47,29,47,32],[39,21,39,24],[39,25,39,28],[39,29,39,32],[41,1,41,4],[42,1,42,66],[41,41,41,44],[41,21,41,24],[41,25,41,28],[41,29,41,32],[41,33,41,36],[41,37,41,40],[43,61,43,64],[45,1,45,4],[40,1,40,65],[39,33,39,36],[45,61,45,64],[43,1,43,4],[43,5,43,8],[43,9,43,12],[43,13,43,16],[43,17,43,20],[43,21,43,24],[43,25,43,28],[104,10,104,14],[105,32,105,35],[89,4,89,66],[104,15,104,19],[103,15,103,19],[104,3,104,9],[105,36,105,40],[98,2,98,80],[101,3,101,9],[103,57,103,61],[102,46,102,50],[103,62,103,66],[93,4,93,66],[100,3,100,29],[90,4,90,66],[101,74,102,80],[104,74,104,80],[105,70,105,73],[105,74,105,80],[111,32,111,35],[113,32,113,35],[108,25,108,29],[113,3,113,9],[112,36,112,40],[112,32,112,35],[0,11,0,17],[0,1,0,10],[30,1,30,66],[17,41,17,44],[17,45,17,48],[17,49,17,52],[17,53,17,56],[17,57,17,60],[17,61,17,64],[17,5,17,8],[17,9,17,12],[17,13,17,16],[17,17,17,20],[17,21,17,24],[17,25,17,28],[17,29,17,32],[79,4,79,66],[67,1,67,38],[107,10,107,14],[107,15,107,19],[105,10,105,14],[105,15,105,19],[105,20,105,24],[107,20,107,24],[108,3,108,9],[109,32,109,35],[110,57,110,61],[109,41,109,45],[110,41,110,45],[108,32,108,35],[109,57,109,61],[109,51,109,56],[108,46,108,50],[108,15,108,19],[109,25,109,29],[108,51,108,56],[110,46,110,50],[108,10,108,14],[108,20,108,24],[105,3,105,9],[106,51,106,56],[106,46,106,50],[106,15,106,19],[106,74,106,80],[103,74,103,80],[106,3,106,9],[106,10,106,14],[106,20,106,24],[104,57,104,61],[101,10,101,29],[102,10,102,14],[102,3,103,9],[106,36,106,40],[102,20,102,24],[103,25,103,29],[103,10,103,14],[103,20,103,24],[103,46,103,50],[101,70,102,73],[102,15,102,19],[101,32,101,45],[105,51,105,56],[105,41,105,45],[104,36,104,40],[103,70,103,73],[106,70,106,73],[107,36,107,40],[106,25,106,29],[107,46,107,50],[52,1,52,66],[107,3,107,9],[73,33,73,40],[73,41,73,48],[73,49,73,56],[73,57,73,64],[68,27,68,41],[102,62,102,66],[106,57,106,61],[107,25,107,29],[80,4,80,66],[82,4,82,66],[83,4,83,66],[103,51,103,56],[87,4,87,66],[88,4,88,66],[106,32,106,35],[105,25,105,29],[91,4,91,66],[101,46,101,66],[60,1,60,66],[61,1,61,66],[39,49,39,52],[39,53,39,56],[39,57,39,60],[39,61,39,64],[41,45,41,48],[41,49,41,52],[41,53,41,56],[41,57,41,60],[41,61,41,64],[39,1,39,4],[39,13,39,16],[39,17,39,20],[39,9,39,12],[39,41,39,44],[39,45,39,48],[41,5,41,8],[41,9,41,12],[41,13,41,16],[41,17,41,20],[58,1,58,66],[47,1,47,4],[47,5,47,8],[47,9,47,12],[72,41,72,48],[71,1,71,66],[73,25,73,32],[72,49,72,56],[72,57,72,64],[73,9,73,16],[73,17,73,24],[102,51,102,56],[95,4,95,66],[96,4,96,66],[92,4,92,66],[102,25,102,29],[102,57,102,61],[100,32,100,66],[94,4,94,66],[102,32,103,35],[102,36,103,40],[90,1,92,3],[93,1,96,3],[84,4,84,66],[85,4,85,66],[67,39,67,41],[69,27,69,41],[72,9,72,16],[72,17,72,24],[72,25,72,32],[70,35,70,41],[72,33,72,40],[72,1,72,8],[87,1,89,3],[73,1,73,8],[86,4,86,66],[76,4,76,66],[69,1,69,26],[77,4,77,66],[70,1,70,33],[68,1,68,26],[74,1,74,66],[81,1,83,3],[84,1,86,3],[81,4,81,66],[78,1,80,3],[75,4,75,66],[78,4,78,66],[75,1,77,3],[210,59,210,64],[108,57,108,61],[102,41,103,45],[104,41,104,45],[107,41,107,45],[107,57,107,61],[106,41,106,45],[104,46,104,50],[104,51,104,56],[105,46,105,50],[109,62,109,66],[105,62,105,66],[104,62,104,66],[106,62,106,66],[109,70,109,73],[113,70,113,80],[110,62,110,66],[112,74,112,80],[113,51,113,56],[107,74,107,80],[107,70,107,73],[113,57,113,61],[113,62,113,66],[107,51,107,56],[107,62,107,66],[110,36,110,40],[111,36,111,40],[111,70,111,73],[111,46,111,50],[111,41,111,45],[113,36,113,40],[113,41,113,45],[113,46,113,50],[112,57,112,61],[111,57,111,61],[112,70,112,73],[110,70,110,73],[110,32,110,35],[109,20,109,24],[110,51,110,56],[104,70,104,73],[109,74,109,80],[108,74,108,80],[105,57,105,61],[108,70,108,73],[112,41,112,45],[111,51,111,56],[108,36,108,40],[109,36,109,40],[108,41,108,45],[108,62,108,66],[110,74,110,80],[112,46,112,50],[109,46,109,50],[112,51,112,56],[111,74,111,80],[112,62,112,66],[107,32,107,35],[104,32,104,35],[104,20,104,24],[104,25,104,29],[278,1,280,32],[278,34,280,65],[234,1,234,6],[234,25,234,32],[234,34,234,41],[234,60,234,65],[212,1,228,32],[212,34,228,65],[230,1,232,32],[230,34,232,65],[236,1,252,32],[236,34,252,65],[254,1,256,32],[254,34,256,65],[258,2,258,7],[258,25,258,32],[260,34,276,65],[258,34,258,41],[258,59,258,64],[260,1,276,32],[258,8,258,24],[258,42,258,58],[234,7,234,24],[234,42,234,58],[162,0,184,0],[182,1,184,32],[182,34,184,65],[158,1,160,32],[140,1,156,32],[138,1,138,7],[158,34,160,65],[140,34,156,65],[164,34,180,65],[138,60,138,65],[138,8,138,24],[138,42,138,59],[162,9,162,24],[162,42,162,57],[162,59,162,64],[162,2,162,8],[109,3,109,9],[113,25,113,29],[109,10,109,14],[113,15,113,19],[112,10,112,14],[112,15,112,19],[112,25,112,29],[112,20,112,24],[111,3,111,9],[111,10,111,14],[111,15,111,19],[110,15,110,19],[110,20,110,24],[110,25,110,29],[110,3,110,9],[110,10,110,14],[109,15,109,19],[111,20,111,24],[113,20,113,24],[112,3,112,9],[210,25,210,32],[111,25,111,29],[115,2,136,80],[210,34,210,41],[206,34,208,65],[206,1,208,32],[188,34,204,65],[186,34,186,41],[186,1,186,6],[138,34,138,41],[210,8,210,24],[210,42,210,58],[210,2,210,7],[186,7,186,24],[186,60,186,65],[164,1,180,32],[188,1,204,32],[186,25,186,32],[162,34,162,41],[186,42,186,59],[138,25,138,32],[162,25,162,32],[113,10,113,14],[111,62,111,66],[1,1,1,4],[7,23,7,25],[11,12,11,22],[1,5,1,18],[7,26,7,30],[9,23,9,25],[7,12,7,22],[10,23,10,25],[11,23,11,25],[8,12,8,22],[3,21,3,29],[4,21,4,29],[1,19,1,31],[11,31,11,33],[3,1,3,9],[4,1,4,9],[9,12,9,22],[2,1,2,4],[9,31,9,33],[2,5,2,18],[10,5,10,11],[7,5,7,11],[8,23,8,25],[9,26,9,30],[8,5,8,11],[7,1,7,4],[19,33,19,36],[13,5,13,11],[14,5,14,11],[9,5,9,11],[8,1,8,4],[9,1,9,4],[10,1,10,4],[11,1,11,4],[12,1,12,4],[12,26,12,30],[19,29,19,32],[11,5,11,11],[12,5,12,11],[19,1,19,4],[19,5,19,8],[19,9,19,12],[19,13,19,16],[19,17,19,20],[12,23,12,25],[12,31,12,33],[14,34,14,43],[15,12,15,22],[21,49,21,52],[27,37,27,40],[27,41,27,44],[39,5,39,8],[36,1,36,66],[25,41,25,44],[25,45,25,48],[38,1,38,66],[34,1,34,66],[37,49,37,52],[37,53,37,56],[37,57,37,60],[37,61,37,64],[37,45,37,48],[37,1,37,4],[37,5,37,8],[37,9,37,12],[37,21,37,24],[37,25,37,28],[37,29,37,32],[37,33,37,36],[37,37,37,40],[37,41,37,44],[39,37,39,40],[13,31,13,33],[25,5,25,8],[27,53,27,56],[25,9,25,12],[20,1,20,66],[21,5,21,8],[21,9,21,12],[21,13,21,16],[23,37,23,40],[23,41,23,44],[23,45,23,48],[23,49,23,52],[23,53,23,56],[23,57,23,60],[23,61,23,64],[22,1,22,66],[21,33,21,36],[21,37,21,40],[13,1,13,4],[14,1,14,4],[15,1,15,4],[19,61,19,64],[21,41,21,44],[21,45,21,48],[17,1,17,4],[19,37,19,40],[19,41,19,44],[19,45,19,48],[19,49,19,52],[19,53,19,56],[15,34,15,43],[15,31,15,33],[19,57,19,60],[15,51,15,54],[19,21,19,24],[19,25,19,28],[17,33,17,36],[17,37,17,40],[15,55,15,58],[21,1,21,4],[10,31,10,33],[11,26,11,30],[13,26,13,30],[14,26,14,30],[14,31,14,33],[13,23,13,25],[12,12,12,22],[18,1,18,66],[14,12,14,22],[14,23,14,25],[10,12,10,22],[10,26,10,30],[15,23,15,25],[15,26,15,30],[13,12,13,22],[21,53,21,56],[21,57,21,60],[21,61,21,64],[21,17,21,20],[21,21,21,24],[21,25,21,28],[21,29,21,32],[15,5,15,11],[9,74,9,80],[6,38,6,58],[13,64,13,69],[15,59,15,63],[14,44,14,50],[15,44,15,50],[13,44,13,50],[11,34,11,43],[13,34,13,43],[2,65,2,80],[12,51,12,54],[11,51,11,54],[10,51,10,54],[10,34,10,43],[2,43,2,44],[10,44,10,50],[8,34,8,43],[9,34,9,43],[9,44,9,50],[6,35,6,37],[7,64,7,69],[9,64,9,69],[11,44,11,50],[10,55,10,58],[7,55,7,58],[7,51,7,54],[7,44,7,50],[12,44,12,50],[8,51,8,54],[9,51,9,54],[4,74,4,80],[7,74,7,80],[8,74,8,80],[0,36,0,55],[8,64,8,69],[14,70,14,73],[11,55,11,58],[12,55,12,58],[10,64,10,69],[11,64,11,69],[12,64,12,69],[8,55,8,58],[9,55,9,58],[2,56,2,64],[1,43,1,44],[1,32,1,42],[7,59,7,63],[4,61,4,64],[3,55,3,60],[4,55,4,60],[3,49,3,54],[4,49,4,54],[3,40,3,48],[4,40,4,48],[13,51,13,54],[14,51,14,54],[13,55,13,58],[0,18,0,21],[0,72,0,80],[0,56,0,71],[1,65,1,80],[1,56,1,64],[14,74,14,80],[2,32,2,42],[12,34,12,43],[7,34,7,43],[8,31,8,33],[8,44,8,50],[2,19,2,31],[3,74,3,80],[11,70,11,73],[7,70,7,73],[0,22,0,35],[4,30,4,39],[9,59,9,63],[10,59,10,63],[13,59,13,63],[14,55,14,58],[1,45,1,55],[10,70,10,73],[2,45,2,55],[3,10,3,20],[8,26,8,30],[16,1,16,66],[5,1,5,9],[5,10,5,80],[3,65,3,73],[4,65,4,73],[11,74,11,80],[12,74,12,80],[8,70,8,73],[9,70,9,73],[10,74,10,80],[11,59,11,63],[15,74,15,80],[13,74,13,80],[12,70,12,73],[13,70,13,73],[14,64,14,69],[12,59,12,63],[15,70,15,73],[8,59,8,63],[14,59,14,63],[15,64,15,66],[3,61,3,64],[27,49,27,52],[25,21,25,24],[25,25,25,28],[25,29,25,32],[25,33,25,36],[25,37,25,40],[25,13,25,16],[25,17,25,20],[29,41,29,44],[29,45,29,48],[29,49,29,52],[26,1,26,66],[25,49,25,52],[25,53,25,56],[25,57,25,60],[25,61,25,64],[29,53,29,56],[29,57,29,60],[29,61,29,64],[27,13,27,16],[32,1,32,66],[50,1,50,66],[45,5,45,8],[45,9,45,12],[45,13,45,16],[45,17,45,20],[37,13,37,16],[37,17,37,20],[33,53,33,56],[33,41,33,44],[33,45,33,48],[33,49,33,52],[33,37,33,40],[33,9,33,12],[33,13,33,16],[33,17,33,20],[33,21,33,24],[33,25,33,28],[33,29,33,32],[33,33,33,36],[47,13,47,16],[47,17,47,20],[47,21,47,24],[47,25,47,28],[31,61,31,64],[29,1,29,4],[29,5,29,8],[29,37,29,40],[29,9,29,12],[29,13,29,16],[29,17,29,20],[29,21,29,24],[29,25,29,28],[29,29,29,32],[29,33,29,36],[31,1,31,4],[31,5,31,8],[31,9,31,12],[31,13,31,16],[31,17,31,20],[23,1,23,4],[23,5,23,8],[23,9,23,12],[23,13,23,16],[23,17,23,20],[23,21,23,24],[23,25,23,28],[23,29,23,32],[23,33,23,36],[24,1,24,66],[31,21,31,24],[31,25,31,28],[31,29,31,32],[31,33,31,36],[27,17,27,20],[27,21,27,24],[27,25,27,28],[27,29,27,32],[27,33,27,36],[28,1,28,66],[27,45,27,48],[27,1,27,4],[27,5,27,8],[27,9,27,12],[27,61,27,64],[27,57,27,60],[31,37,31,40],[31,41,31,44],[31,45,31,48],[31,49,31,52],[31,53,31,56],[25,1,25,4],[31,57,31,60],[4,10,4,20],[6,1,6,34],[3,30,3,39],[7,31,7,33],[33,57,33,60],[33,61,33,64],[35,1,35,4],[35,5,35,8],[35,9,35,12],[35,13,35,16],[35,17,35,20],[35,21,35,24],[35,25,35,28],[35,29,35,32],[35,33,35,36],[35,37,35,40],[35,41,35,44],[35,45,35,48],[35,49,35,52],[35,53,35,56],[35,57,35,60],[35,61,35,64],[33,1,33,4],[33,5,33,8]]}
[null,"TAB Partner -",null,null,null,null,null,null,null,null,null,{"$f":"'Store Data'!J10","v":"National TAB"},null,null,null,null,null,null,"Tech-",null,null,null,null,null,null,null,null,null,null,null,null,null,null,null,null,null,"CONDITION SURVEY",null,null,null,null,null,null,null,null,null,null,null,null,null,null,null,null,null,null,null,"Survey Due Date -",null,null,null,null,null,null,null,null,null,null,null,null,null,null,null,{"$f":"'Store Data'!C10","v":"2025-11-11"}]
[null,"UNIT #",null,null,null,"UNIT NAME",null,null,null,null,null,null,null,null,null,null,null,null,null,"STREET ADDRESS",null,null,null,null,null,null,null,null,null,null,null,null,"CITY",null,null,null,null,null,null,null,null,null,null,"ST",null,"OPERATOR",null,null,null,null,null,null,null,null,null,null,"PHONE #",null,null,null,null,null,null,null,null,"EMAIL"]
[null,{"$f":"'Store Data'!A10","v":2233},null,null,null,{"$f":"'Store Data'!F10","v":"Bristow FSU"},null,null,null,null,null,null,null,null,null,null,null,null,null,{"$f":"'Store Data'!K10","v":"9939 Sowder Village Sq"},null,null,null,null,null,null,null,null,null,null,null,null,{"$f":"'Store Data'!L10","v":"Manassas"},null,null,null,null,null,null,null,null,null,null,{"$f":"'Store Data'!M10","v":"VA"},null,{"$f":"'Store Data'!O10","v":"Jeremy Smith"},null,null,null,null,null,null,null,null,null,null,{"$f":"'Store Data'!W10","v":7033659292},null,null,null,null,null,null,null,null,{"$f":"'Store Data'!X10","v":"02233@chick-fil-a.com"}]
[null,"CONSTRUCTION MGR (CM)",null,null,null,null,null,null,null,null,"SR PROGRAM MGR (SRP)",null,null,null,null,null,null,null,null,null,null,"SR PROGRAM LEAD (SRPL)",null,null,null,null,null,null,null,null,"FEQ FIELD CONSULTANT",null,null,null,null,null,null,null,null,null,"SR DEVELOP. MGR",null,null,null,null,null,null,null,null,"PROTO-TYPE",null,null,null,null,null,"OPEN DATE",null,null,null,null,null,"UNIT AGE",null,null,null,"CONSTR START",null,null,null,null,null,null,null,null,"ARCHITECT"]
[null,{"$f":"'Store Data'!R10","v":"Ken Misso"},null,null,null,null,null,null,null,null,{"$f":"'Store Data'!S10","v":"Andrew Turner"},null,null,null,null,null,null,null,null,null,null,{"$f":"'Store Data'!P10","v":"Chad Baker"},null,null,null,null,null,null,null,null,{"$f":"'Store Data'!T10","v":"Keith Nelson"},null,null,null,null,null,null,null,null,null,{"$f":"'Store Data'!Q10","v":"Kayla Britton"},null,null,null,null,null,null,null,null,{"$f":"'Store Data'!$H$10","v":"S06E-R"},null,null,null,null,null,{"$f":"'Store Data'!$V$10","v":"2009-04-02"},null,null,null,null,null,{"$f":"(TODAY()-BD5)/365","v":16.736986301369864},null,null,null,"2026-01-24",null,null,null,null,null,null,null,null,{"$f":"'Store Data'!U10","v":0}]
[null,"SCOPE OF WORK",null,null,null,null,null,null,null,null,{"$f":"'Store Data'!$G$10","v":"Centerline 3.0, Brand Image, Drive-Thru Modification, JLOP Dual, F@F Dual, OMD Single, Drive-Thru Door, MLv1 Conversion, Parallel Drive Thru Cockpit, Side Dining Conversion, Signage"}]
[null,"SYNEXIS - ACTIVE/INACTIVE/NOT INSTALLED",null,null,null,null,null,null,null,null,null,null,null,null,null,null,null,null,null,null,null,null,null,null,null,null,null,null,null,null,null,null,null,null,null,null,null,null,{"$f":"IFERROR(VLOOKUP(B3,SYNEXIS!A2:C418,2,FALSE),\"NOT INSTALLED\")","v":"NOT INSTALLED"}]
[null,"RTU#",null,null,null,"SERIAL #",null,null,null,null,null,null,"MODEL #",null,null,null,null,null,null,null,null,null,null,"TON",null,null,"MFG.",null,null,null,null,"AGE",null,null,"HVAC UNIT TYPE",null,null,null,null,null,null,null,null,null,"AREA SERVED"]
[null,"RTU1",null,null,null,{"$f":"'Store Data'!Y10","v":"05621J05571"},null,null,null,null,null,null,{"$f":"'Store Data'!Z10","v":"LGH180H4BH4Y"},null,null,null,null,null,null,null,null,null,null,{"$f":"IF(MID(M9,7,2)=\"05\",\"4\",IF(MID(M9,7,2)=\"06\",\"5\",IF(MID(M9,7,2)=\"07\",\"6\",IF(MID(M9,7,2)=\"08\",\"7.5\",IF(MID(M9,7,2)=\"09\",\"8.5\",IF(MID(M9,7,2)=\"12\",\"10\",IF(MID(M9,7,2)=\"14\",\"12.5\",IF(MID(M9,7,2)=\"16\",\"15\",IF(MID(M9,4,3)=\"300\",\"25\",IF(MID(M9,4,3)=\"240\",\"20\",IF(MID(M9,4,3)=\"210\",\"17.5\",IF(MID(M9,4,3)=\"180\",\"15\",IF(MID(M9,4,3)=\"150\",\"12.5\",IF(MID(M9,4,3)=\"120\",\"10\",IF(MID(M9,4,3)=\"102\",\"8.5\",IF(MID(M9,4,3)=\"090\",\"7.5\",IF(MID(M9,4,3)=\"092\",\"7.5\",IF(MID(M9,4,3)=\"072\",\"6\",IF(MID(M9,4,3)=\"060\",\"5\",IF(MID(M9,4,3)=\"036\",\"3\",IF(MID(M9,4,3)=\"048\",\"4\",IF(MID(M9,4,3)=\"015\",\"15\",\"\"))))))))))))))))))))))","v":"15"},null,null,{"$f":"IF(M9=0,\"\",IF(MID(M9,1,2)=\"RN\",\"AAON\",IF(MID(M9,1,3)=\"LHC\",\"Lennox\",IF(MID(M9,1,3)=\"LHA\",\"Lennox\",IF(MID(M9,1,3)=\"KHA\",\"Lennox\",IF(MID(M9,1,3)=\"LCH\",\"Lennox\",IF(MID(M9,1,3)=\"LCA\",\"Lennox\",IF(MID(M9,1,3)=\"LGA\",\"Lennox\",IF(MID(M9,1,3)=\"LGC\",\"Lennox\",IF(MID(M9,1,3)=\"YHD\",\"TRANE\",IF(MID(M9,1,3)=\"LGH\",\"Lennox\",\"Carrier\")))))))))))","v":"Lennox"},null,null,null,null,{"$f":"'Store Data'!AB10","v":4.3123287671232875},null,null,{"$f":"IF(F9=0,\"\",IF(MID(M9,1,2)=\"RN\",\"RN SERIES\",IF(MID(M9,1,3)=\"YSC\",\"TRANE\",IF(MID(M9,1,3)=\"50K\",\"WEAMaker SE\",IF(MID(M9,1,4)=\"48ES\",\"Comfort\",IF(MID(M9,1,3)=\"48H\",\"WEAMaster HE\",IF(MID(M9,1,3)=\"48T\",\"WEAMaker SE\",IF(MID(M9,3,2)=\"HP\",\"HEAT PUMP\",IF(MID(M9,3,2)=\"KC\",\"WEAMaker SE\",IF(MID(M9,3,2)=\"FC\",\"WEAMaker EcoBlue\",IF(MID(M9,1,3)=\"KGB\",\"LANDMARK\",IF(COUNT(FIND({5610,5611,5612,5613,5614,5615,5616,5617,5618,5619,5620,5621,5622,5623,5624,5625},F9))>0,\"ENERGENCE\",\"L SERIES\"))))))))))))","v":"ENERGENCE"},null,null,null,null,null,null,null,null,null,{"$f":"IF(MID(AX5,1,7)=\"S97-100\",\"RR/DIN A/ENTA\",IF(MID(AX5,1,7)=\"S97-110\",\"RR/DIN A/ENT A\",IF(MID(AX5,1,7)=\"S97-120\",\"RR/DIN A\",IF(MID(AX5,1,7)=\"S97-136\",\"RR/DIN A\",IF(MID(AX5,1,7)=\"S97-138\",\"RR/DIN A\",IF(MID(AX5,1,4)=\"S03A\",\"KITCHEN\",IF(MID(AX5,1,4)=\"S03C\",\"KITCHEN\",IF(MID(AX5,1,4)=\"S03E\",\"KITCHEN\",IF(MID(AX5,1,7)=\"S03-128\",\"KITHEN\",IF(MID(AX5,1,7)=\"S03-146\",\"KITCHEN\",IF(MID(AX5,1,9)=\"S03-150SW\",\"KITCHEN\",IF(MID(AX5,1,7)=\"S04-110\",\"KITCHEN\",IF(MID(AX5,1,3)=\"S04\",\"Kitchen\",IF(MID(AX5,1,4)=\"S06A\",\"KITCHEN\",IF(MID(AX5,1,4)=\"S06B\",\"KITCHEN\",IF(MID(AX5,1,4)=\"S06C\",\"KITCHEN\",IF(MID(AX5,1,4)=\"S06E\",\"KITCHEN\",IF(MID(AX5,1,10)=\"S06 Narrow\",\"KITCHCEN\",IF(MID(AX5,1,7)=\"S08N SM\",\"KITCHEN\",IF(MID(AX5,1,4)=\"S08A\",\"KITCHEN\",IF(MID(AX5,1,4)=\"S08C\",\"KITCHEN/ELEC\",IF(MID(AX5,1,4)=\"S08E\",\"KITCHEN\",IF(MID(AX5,1,6)=\"S08N-T\",\"KITCHEN\",IF(MID(AX5,1,7)=\"S08N-LG\",\"KITCHEN\",IF(MID(AX5,9,2)=\"AZ\",\"KITCHEN\",IF(MID(AX5,1,2)=\"KK\",\"MECH/MP/KITCHEN\",\"\"))))))))))))))))))))))))))","v":"KITCHEN"}]
[null,"RTU2",null,null,null,{"$f":"'Store Data'!AD10","v":"5609A00420"},null,null,null,null,null,null,{"$f":"'Store Data'!AE10","v":"LGA102H2BH4Y"},null,null,null,null,null,null,null,null,null,null,{"$f":"IF(MID(M10,7,2)=\"05\",\"4\",IF(MID(M10,7,2)=\"06\",\"5\",IF(MID(M10,7,2)=\"07\",\"6\",IF(MID(M10,7,2)=\"08\",\"7.5\",IF(MID(M10,7,2)=\"09\",\"8.5\",IF(MID(M10,7,2)=\"12\",\"10\",IF(MID(M10,7,2)=\"14\",\"12.5\",IF(MID(M10,7,2)=\"16\",\"15\",IF(MID(M10,4,3)=\"300\",\"25\",IF(MID(M10,4,3)=\"210\",\"17.5\",IF(MID(M10,4,3)=\"180\",\"15\",IF(MID(M10,4,3)=\"150\",\"12.5\",IF(MID(M10,4,3)=\"120\",\"10\",IF(MID(M10,4,3)=\"102\",\"8.5\",IF(MID(M10,4,3)=\"090\",\"7.5\",IF(MID(M10,4,3)=\"092\",\"7.5\",IF(MID(M10,4,3)=\"072\",\"6\",IF(MID(M10,4,3)=\"060\",\"5\",IF(MID(M10,4,3)=\"036\",\"3\",IF(MID(M10,4,3)=\"048\",\"4\",\"\"))))))))))))))))))))","v":"8.5"},null,null,{"$f":"IF(M10=0,\"\",IF(MID(M10,1,2)=\"RN\",\"AAON\",IF(MID(M10,1,3)=\"LHC\",\"Lennox\",IF(MID(M10,1,3)=\"LHA\",\"Lennox\",IF(MID(M10,1,3)=\"KHA\",\"Lennox\",IF(MID(M10,1,3)=\"LCH\",\"Lennox\",IF(MID(M10,1,3)=\"LCA\",\"Lennox\",IF(MID(M10,1,3)=\"LGA\",\"Lennox\",IF(MID(M10,1,3)=\"LGC\",\"Lennox\",IF(MID(M10,1,3)=\"YHD\",\"TRANE\",IF(MID(M10,1,3)=\"LGH\",\"Lennox\",\"Carrier\")))))))))))","v":"Lennox"},null,null,null,null,{"$f":"'Store Data'!AG10","v":16.986301369863014},null,null,{"$f":"IF(F10=0,\"\",IF(MID(M10,1,2)=\"RN\",\"RN SERIES\",IF(MID(M10,1,3)=\"YSC\",\"TRANE\",IF(MID(M10,1,3)=\"50K\",\"WEAMaker SE\",IF(MID(M10,1,4)=\"48ES\",\"Comfort\",IF(MID(M10,1,3)=\"48H\",\"WEAMaster HE\",IF(MID(M10,1,3)=\"48T\",\"WEAMaker SE\",IF(MID(M10,3,2)=\"HP\",\"HEAT PUMP\",IF(MID(M10,3,2)=\"KC\",\"WEAMaker SE\",IF(MID(M10,3,2)=\"FC\",\"WEAMaker EcoBlue\",IF(MID(M10,1,3)=\"KGB\",\"LANDMARK\",IF(COUNT(FIND({5610,5611,5612,5613,5614,5615,5616,5617,5618,5619,5620,5621,5622,5623,5624,5625},F10))>0,\"ENERGENCE\",\"L SERIES\"))))))))))))","v":"L SERIES"},null,null,null,null,null,null,null,null,null,{"$f":"IF(MID(AX5,1,7)=\"S97-100\",\"KITCHEN\",IF(MID(AX5,1,7)=\"S97-110\",\"KITCHEN\",IF(MID(AX5,1,7)=\"S97-120\",\"KITCHEN\",IF(MID(AX5,1,7)=\"S97-136\",\"KITCHEN\",IF(MID(AX5,1,7)=\"S97-138\",\"KITCHEN\",IF(MID(AX5,1,4)=\"S03A\",\"SERV/ENT A/\",IF(MID(AX5,1,4)=\"S03C\",\"MECH/RR/DIN A\",IF(MID(AX5,1,4)=\"S03E\",\"MECH/RR/DINA\",IF(MID(AX5,1,7)=\"S03-128\",\"RR/DIN A/MECH/ELEC\",IF(MID(AX5,1,7)=\"S03-146\",\"RR/DIN A\",IF(MID(AX5,1,9)=\"S03-150SW\",\"RR/DIN A/MECH\",IF(MID(AX5,1,7)=\"S04-110\",\"MECH/RR/DIN A\",IF(MID(AX5,1,3)=\"S04\",\"Mech/RR/Din A\",IF(MID(AX5,1,4)=\"S06A\",\"ENT A/SERV/DT\",IF(MID(AX5,1,4)=\"S06B\",\"MECH/RR/DIN A\",IF(MID(AX5,1,4)=\"S06C\",\"MECH/RR/DIN A\",IF(MID(AX5,1,4)=\"S06E\",\"MECH/RR/DIN A\",IF(MID(AX5,1,10)=\"S06 Narrow\",\"DIN A/RR\",IF(MID(AX5,1,4)=\"S08A\",\"DT/SERV/ENT\",IF(MID(AX5,1,4)=\"S08C\",\"DIN A/RR/MECH/BRK\",IF(MID(AX5,1,4)=\"S08E\",\"DIN A/RR/BRK RM/MECH\",IF(MID(AX5,1,6)=\"S08N-T\",\"MECH/RR/DIN A/ENT A\",IF(MID(AX5,1,7)=\"S08N SM\",\"MECH/RR/DIN A/ENT A\",IF(MID(AX5,1,7)=\"S08N-LG\",\"MECH/RR/DIN A/ENT A\",IF(MID(AX5,9,2)=\"AZ\",\"DINING\",IF(MID(AX5,1,2)=\"KK\",\"RR/DIN A,/ENT A\",\"\"))))))))))))))))))))))))))","v":"MECH/RR/DIN A"}]
[null,"RTU3",null,null,null,{"$f":"'Store Data'!AI10","v":"5622H07235"},null,null,null,null,null,null,{"$f":"'Store Data'!AJ10","v":"LGH150H4BH2Y"},null,null,null,null,null,null,null,null,null,null,{"$f":"IF(MID(M11,7,2)=\"05\",\"4\",IF(MID(M11,7,2)=\"06\",\"5\",IF(MID(M11,7,2)=\"07\",\"6\",IF(MID(M11,7,2)=\"08\",\"7.5\",IF(MID(M11,7,2)=\"09\",\"8.5\",IF(MID(M11,7,2)=\"12\",\"10\",IF(MID(M11,7,2)=\"14\",\"12.5\",IF(MID(M11,7,2)=\"16\",\"15\",IF(MID(M11,4,3)=\"300\",\"25\",IF(MID(M11,4,3)=\"240\",\"20\",IF(MID(M11,4,3)=\"180\",\"15\",IF(MID(M11,4,3)=\"150\",\"12.5\",IF(MID(M11,4,3)=\"120\",\"10\",IF(MID(M11,4,3)=\"102\",\"8.5\",IF(MID(M11,4,3)=\"090\",\"7.5\",IF(MID(M11,4,3)=\"092\",\"7.5\",IF(MID(M11,4,3)=\"072\",\"6\",IF(MID(M11,4,3)=\"060\",\"5\",IF(MID(M11,4,3)=\"036\",\"3\",IF(MID(M11,4,3)=\"048\",\"4\",\"\"))))))))))))))))))))","v":"12.5"},null,null,"Lennox",null,null,null,null,{"$f":"'Store Data'!AL10","v":3.3972602739726026},null,null,{"$f":"IF(F11=0,\"\",IF(MID(M11,1,2)=\"RN\",\"RN SERIES\",IF(MID(M11,1,3)=\"YSC\",\"TRANE\",IF(MID(M11,1,3)=\"50K\",\"WEAMaker SE\",IF(MID(M11,1,4)=\"48ES\",\"Comfort\",IF(MID(M11,1,3)=\"48H\",\"WEAMaster HE\",IF(MID(M11,1,3)=\"48T\",\"WEAMaker SE\",IF(MID(M11,3,2)=\"HP\",\"HEAT PUMP\",IF(MID(M11,3,2)=\"KC\",\"WEAMaker SE\",IF(MID(M11,3,2)=\"FC\",\"WEAMaker EcoBlue\",IF(MID(M11,1,3)=\"KGB\",\"LANDMARK\",IF(COUNT(FIND({5610,5611,5612,5613,5614,5615,5616,5617,5618,5619,5620,5621,5622,5623,5624,5625},F11))>0,\"ENERGENCE\",\"L SERIES\"))))))))))))","v":"ENERGENCE"},null,null,null,null,null,null,null,null,null,{"$f":"IF(MID(AX5,1,7)=\"S97-100\",\"SERV/DT/ENT B\",IF(MID(AX5,1,7)=\"S97-110\",\"SERV/DT/ENT B\",IF(MID(AX5,1,7)=\"S97-120\",\"SERV/DIN B/DT\",IF(MID(AX5,1,7)=\"S97-136\",\"SERV/DT/ENTB\",IF(MID(AX5,1,7)=\"S97-138\",\"SERV/DT/DIN B/ENT B\",IF(MID(AX5,1,4)=\"S03A\",\"DIN B/RR\",IF(MID(AX5,1,4)=\"S03C\",\"SERV/DT/DIN B/ENT B\",IF(MID(AX5,1,4)=\"S03E\",\"SERV/DIN B/ENT A&B\",IF(MID(AX5,1,7)=\"S03-128\",\"SERV/DIN B/ENT B/DT\",IF(MID(AX5,1,7)=\"S03-146\",\"ENT A/DIN B\",IF(MID(AX5,1,9)=\"S03-150SW\",\"ENT A/DIN B\",IF(MID(AX5,1,7)=\"S04-110\",\"DT/SERV/DIN B/ENT A&B\",IF(MID(AX5,1,3)=\"S04\",\"SERV/DT/DIN B/ENT B\",IF(MID(AX5,1,4)=\"S06A\",\"RR/DIN\",IF(MID(AX5,1,4)=\"S06B\",\"DT/SERV/DIN B/ENT B\",IF(MID(AX5,1,4)=\"S06C\",\"SERV/DT/DIN B/ENT B\",IF(MID(AX5,1,4)=\"S06E\",\"SERV/DT/ENTB,/DIN B\",IF(MID(AX5,1,10)=\"S06 Narrow\",\"DIN B/DT/SERV\",IF(MID(AX5,1,4)=\"S08A\",\"RR/DINING\",IF(MID(AX5,1,4)=\"S08C\",\"DINB/SERV/DT/ENT B\",IF(MID(AX5,1,4)=\"S08E\",\"DINB/SERV/DT/ENT A&B\",IF(MID(AX5,1,6)=\"S08N-T\",\"DIN B\",IF(MID(AX5,1,7)=\"S08N SM\",\"DINB/SERV/DT\",IF(MID(AX5,1,7)=\"S08N-LG\",\"DIN B\",IF(MID(AX5,9,2)=\"AZ\",\"ENTRY/DINING\",IF(MID(AX5,1,2)=\"KK\",\"DIN B\",\"\"))))))))))))))))))))))))))","v":"SERV/DT/ENTB,/DIN B"}]
[null,"RTU4",null,null,null,{"$f":"'Store Data'!AN10","v":"5609A "},null,null,null,null,null,null,{"$f":"'Store Data'!AO10","v":"LGH060"},null,null,null,null,null,null,null,null,null,null,"5",null,null,"Lennox",null,null,null,null,{"$f":"'Store Data'!AQ10","v":126.06575342465753},null,null,{"$f":"IF(F12=0,\"\",IF(MID(M12,1,2)=\"RN\",\"RN SERIES\",IF(MID(M12,1,3)=\"YSC\",\"TRANE\",IF(MID(M12,1,3)=\"50K\",\"WEAMaker SE\",IF(MID(M12,1,4)=\"48ES\",\"Comfort\",IF(MID(M12,1,3)=\"48H\",\"WEAMaster HE\",IF(MID(M12,1,3)=\"48T\",\"WEAMaker SE\",IF(MID(M12,3,2)=\"HP\",\"HEAT PUMP\",IF(MID(M12,3,2)=\"KC\",\"WEAMaker SE\",IF(MID(M12,3,2)=\"FC\",\"WEAMaker EcoBlue\",IF(MID(M12,1,3)=\"KGB\",\"LANDMARK\",IF(COUNT(FIND({5610,5611,5612,5613,5614,5615,5616,5617,5618,5619,5620,5621,5622,5623,5624,5625},F12))>0,\"ENERGENCE\",\"L SERIES\"))))))))))))","v":"L SERIES"},null,null,null,null,null,null,null,null,null,{"$f":"IF(MID(AX5,1,7)=\"S97-100\",\"DIN B/ENT A\",IF(MID(AX5,1,7)=\"S97-110\",\"PLAYLAND\",IF(MID(AX5,1,7)=\"S97-120\",\"ENTA/DIN B\",IF(MID(AX5,1,7)=\"S97-136\",\"DIN B/ENT A\",IF(MID(AX5,1,7)=\"S97-138\",\"ENT A/DIN B\",IF(MID(AX5,1,4)=\"S03A\",\"PLAYLAND\",IF(MID(AX5,1,4)=\"S03C\",\"ENT A/DIN B\",IF(MID(AX5,1,4)=\"S03E\",\"PLAYLAND\",IF(MID(AX5,1,7)=\"S03-128\",\"ENT A/DIN B\",IF(MID(AX5,1,7)=\"S03-146\",\"SERV/DIN B\",IF(MID(AX5,1,9)=\"S03-150SW\",\"SERV/DIN B\",IF(MID(AX5,1,7)=\"S04-110\",\"PLAYLAND\",IF(MID(AX5,1,3)=\"S04\",\"ENTA/DIN B\",IF(MID(AX5,1,4)=\"S06A\",\"PLAYLAND\",IF(MID(AX5,1,4)=\"S06B\",\"ENT A/DIN B\",IF(MID(AX5,1,4)=\"S06C\",\"ENT A/DIN B\",IF(MID(AX5,1,4)=\"S06E\",\"PLAYLAND\",IF(MID(AX5,1,10)=\"S06 Narrow\",\"PLAYLAND\",IF(MID(AX5,1,4)=\"S08A\",\"PLAYLAND\",IF(MID(AX5,1,4)=\"S08C\",\"DIN B/ENT A\",IF(MID(AO5,1,4)=\"S08E\",\"PLAYLAND\",IF(MID(AX5,1,6)=\"S08N-T\",\"DT,SERV/DIN B\",IF(MID(AX5,1,7)=\"S08N SM\",\"PLAYLAND\",IF(MID(AX5,1,7)=\"S08N-LG\",\"DT/SERV/DIN B\",IF(MID(AX5,9,2)=\"AZ\",\"SERV/DINING/RR/DT\",IF(MID(AX5,1,2)=\"KK\",\"SERV/DIN B\",\"\"))))))))))))))))))))))))))","v":"PLAYLAND"}]
[null,"RTU5",null,null,null,{"$f":"'Store Data'!AS10","v":0},null,null,null,null,null,null,{"$f":"'Store Data'!AT10","v":0},null,null,null,null,null,null,null,null,null,null,{"$f":"IF(MID(M13,7,2)=\"05\",\"4\",IF(MID(M13,7,2)=\"06\",\"5\",IF(MID(M13,7,2)=\"07\",\"6\",IF(MID(M13,7,2)=\"08\",\"7.5\",IF(MID(M13,7,2)=\"09\",\"8.5\",IF(MID(M13,7,2)=\"12\",\"10\",IF(MID(M13,7,2)=\"14\",\"12.5\",IF(MID(M13,7,2)=\"16\",\"15\",IF(MID(M13,4,3)=\"300\",\"25\",IF(MID(M13,4,3)=\"210\",\"17.5\",IF(MID(M13,4,3)=\"180\",\"15\",IF(MID(M13,4,3)=\"150\",\"12.5\",IF(MID(M13,4,3)=\"120\",\"10\",IF(MID(M13,4,3)=\"102\",\"8.5\",IF(MID(M13,4,3)=\"090\",\"7.5\",IF(MID(M13,4,3)=\"092\",\"7.5\",IF(MID(M13,4,3)=\"072\",\"6\",IF(MID(M13,4,3)=\"060\",\"5\",IF(MID(M13,4,3)=\"036\",\"3\",IF(MID(M13,4,3)=\"048\",\"4\",\"\"))))))))))))))))))))","v":""},null,null,"",null,null,null,null,{"$f":"'Store Data'!AV10","v":0},null,null,{"$f":"IF(F13=0,\"\",IF(MID(M13,1,2)=\"RN\",\"RN SERIES\",IF(MID(M13,1,3)=\"YSC\",\"TRANE\",IF(MID(M13,1,3)=\"50K\",\"WEAMaker SE\",IF(MID(M13,1,4)=\"48ES\",\"Comfort\",IF(MID(M13,1,3)=\"48H\",\"WEAMaster HE\",IF(MID(M13,1,3)=\"48T\",\"WEAMaker SE\",IF(MID(M13,3,2)=\"HP\",\"HEAT PUMP\",IF(MID(M13,3,2)=\"KC\",\"WEAMaker SE\",IF(MID(M13,3,2)=\"FC\",\"WEAMaker EcoBlue\",IF(MID(M13,1,3)=\"KGB\",\"LANDMARK\",IF(COUNT(FIND({5610,5611,5612,5613,5614,5615,5616,5617,5618,5619,5620,5621,5622,5623,5624,5625},F13))>0,\"ENERGENCE\",\"L SERIES\"))))))))))))","v":""},null,null,null,null,null,null,null,null,null,null,null,null,null,null,null,null,null,null,null,null,null,null,null,null,null,null,null,null,null,null,null,null,null,null,null,null,null,null,null,null,null,null,null,null,null,null,null,null,null,null,null,null,null,null,null,null,null,{"$f":"COUNTIF(AI9:AR10,\"=\")","v":18}]
[null,"RTU6",null,null,null,{"$f":"'Store Data'!AX10","v":0},null,null,null,null,null,null,{"$f":"'Store Data'!AY10","v":0},null,null,null,null,null,null,null,null,null,null,{"$f":"IF(MID(M14,7,2)=\"05\",\"4\",IF(MID(M14,7,2)=\"06\",\"5\",IF(MID(M14,7,2)=\"07\",\"6\",IF(MID(M14,7,2)=\"08\",\"7.5\",IF(MID(M14,7,2)=\"09\",\"8.5\",IF(MID(M14,7,2)=\"12\",\"10\",IF(MID(M14,7,2)=\"14\",\"12.5\",IF(MID(M14,7,2)=\"16\",\"15\",IF(MID(M14,4,3)=\"300\",\"25\",IF(MID(M14,4,3)=\"210\",\"17.5\",IF(MID(M14,4,3)=\"180\",\"15\",IF(MID(M14,4,3)=\"150\",\"12.5\",IF(MID(M14,4,3)=\"120\",\"10\",IF(MID(M14,4,3)=\"102\",\"8.5\",IF(MID(M14,4,3)=\"090\",\"7.5\",IF(MID(M14,4,3)=\"092\",\"7.5\",IF(MID(M14,4,3)=\"072\",\"6\",IF(MID(M14,4,3)=\"060\",\"5\",IF(MID(M14,4,3)=\"036\",\"3\",IF(MID(M14,4,3)=\"048\",\"4\",\"\"))))))))))))))))))))","v":""},null,null,"",null,null,null,null,{"$f":"'Store Data'!BA10","v":0},null,null,{"$f":"IF(F14=0,\"\",IF(MID(M14,1,2)=\"RN\",\"RN SERIES\",IF(MID(M14,1,3)=\"YSC\",\"TRANE\",IF(MID(M14,1,3)=\"50K\",\"WEAMaker SE\",IF(MID(M14,1,4)=\"48ES\",\"Comfort\",IF(MID(M14,1,3)=\"48H\",\"WEAMaster HE\",IF(MID(M14,1,3)=\"48T\",\"WEAMaker SE\",IF(MID(M14,3,2)=\"HP\",\"HEAT PUMP\",IF(MID(M14,3,2)=\"KC\",\"WEAMaker SE\",IF(MID(M14,3,2)=\"FC\",\"WEAMaker EcoBlue\",IF(MID(M14,1,3)=\"KGB\",\"LANDMARK\",IF(COUNT(FIND({5610,5611,5612,5613,5614,5615,5616,5617,5618,5619,5620,5621,5622,5623,5624,5625},F14))>0,\"ENERGENCE\",\"L SERIES\"))))))))))))","v":""},null,null,null,null,null,null,null,null,null,{"$f":"IF(MID(AX5,1,7)=\"S04-162\",\"OFFICE/BREAK ROOM\",IF(MID(AX5,9,2)=\"AZ\",\"PLAYLAND\",\"\"))","v":""}]
[null,"RTU7",null,null,null,{"$f":"'Store Data'!BC10","v":0},null,null,null,null,null,null,{"$f":"'Store Data'!BD10","v":0},null,null,null,null,null,null,null,null,null,null,{"$f":"IF(MID(M15,7,2)=\"05\",\"4\",IF(MID(M15,7,2)=\"06\",\"5\",IF(MID(M15,7,2)=\"07\",\"6\",IF(MID(M15,7,2)=\"08\",\"7.5\",IF(MID(M15,7,2)=\"09\",\"8.5\",IF(MID(M15,7,2)=\"12\",\"10\",IF(MID(M15,7,2)=\"14\",\"12.5\",IF(MID(M15,7,2)=\"16\",\"15\",IF(MID(M15,4,3)=\"300\",\"25\",IF(MID(M15,4,3)=\"210\",\"17.5\",IF(MID(M15,4,3)=\"180\",\"15\",IF(MID(M15,4,3)=\"150\",\"12.5\",IF(MID(M15,4,3)=\"120\",\"10\",IF(MID(M15,4,3)=\"102\",\"8.5\",IF(MID(M15,4,3)=\"090\",\"7.5\",IF(MID(M15,4,3)=\"092\",\"7.5\",IF(MID(M15,4,3)=\"072\",\"6\",IF(MID(M15,4,3)=\"060\",\"5\",IF(MID(M15,4,3)=\"036\",\"3\",IF(MID(M15,4,3)=\"048\",\"4\",\"\"))))))))))))))))))))","v":""},null,null,"",null,null,null,null,{"$f":"'Store Data'!BF10","v":0},null,null,{"$f":"IF(F15=0,\"\",IF(MID(M15,1,2)=\"RN\",\"RN SERIES\",IF(MID(M15,1,3)=\"YSC\",\"TRANE\",IF(MID(M15,1,3)=\"50K\",\"WEAMaker SE\",IF(MID(M15,1,4)=\"48ES\",\"Comfort\",IF(MID(M15,1,3)=\"48H\",\"WEAMaster HE\",IF(MID(M15,1,3)=\"48T\",\"WEAMaker SE\",IF(MID(M15,3,2)=\"HP\",\"HEAT PUMP\",IF(MID(M15,3,2)=\"KC\",\"WEAMaker SE\",IF(MID(M15,3,2)=\"FC\",\"WEAMaker EcoBlue\",IF(MID(M15,1,3)=\"KGB\",\"LANDMARK\",IF(COUNT(FIND({5610,5611,5612,5613,5614,5615,5616,5617,5618,5619,5620,5621,5622,5623,5624,5625},F15))>0,\"ENERGENCE\",\"L SERIES\"))))))))))))","v":""}]
[null,"RTU8",null,null,null,{"$f":"'Store Data'!BH10","v":0},null,null,null,null,null,null,{"$f":"'Store Data'!BI10","v":0},null,null,null,null,null,null,null,null,null,null,"",null,null,"",null,null,null,null,{"$f":"'Store Data'!BK10","v":0},null,null,{"$f":"IF(F16=0,\"\",IF(MID(M16,1,2)=\"RN\",\"RN SERIES\",IF(MID(M16,1,3)=\"YSC\",\"TRANE\",IF(MID(M16,1,3)=\"50K\",\"WEAMaker SE\",IF(MID(M16,1,4)=\"48ES\",\"Comfort\",IF(MID(M16,1,3)=\"48H\",\"WEAMaster HE\",IF(MID(M16,1,3)=\"48T\",\"WEAMaker SE\",IF(MID(M16,3,2)=\"HP\",\"HEAT PUMP\",IF(MID(M16,3,2)=\"KC\",\"WEAMaker SE\",IF(MID(M16,3,2)=\"FC\",\"WEAMaker EcoBlue\",IF(MID(M16,1,3)=\"KGB\",\"LANDMARK\",IF(COUNT(FIND({5610,5611,5612,5613,5614,5615,5616,5617,5618,5619,5620,5621,5622,5623,5624,5625},F16))>0,\"ENERGENCE\",\"L SERIES\"))))))))))))","v":""}]
[null,"1.  Using punch/screwdriver, prod heat exchanger tubes.  If holes found and/or prod test fails enter YES, lockout unit and infom management. If not, enter NO."]
[null,"RTU1",null,null,null,{"$f":"'RTU1'!K7","v":0},null,null,null,"RTU2",null,null,null,{"$f":"'RTU2'!K7","v":0},null,null,null,"RTU3",null,null,null,{"$f":"'RTU3'!K7","v":0},null,null,null,"RTU4",null,null,null,{"$f":"'RTU4'!K7","v":0},null,null,null,"RTU5",null,null,null,{"$f":"'RTU5'!K7","v":0},null,null,null,"RTU6",null,null,null,{"$f":"'RTU6'!K7","v":0},null,null,null,"RTU7",null,null,null,{"$f":"'RTU7'!K7","v":0},null,null,null,"RTU8",null,null,null,{"$f":"'RTU8'!K7","v":0}]
[null,"2.  Quantify damage/deterioration to the condenser coil, and enter value 0% to 100%."]
[null,"RTU1",null,null,null,{"$f":"'RTU1'!K8","v":"N/A"},null,null,null,"RTU2",null,null,null,{"$f":"'RTU2'!K8","v":0},null,null,null,"RTU3",null,null,null,{"$f":"'RTU3'!K8","v":0},null,null,null,"RTU4",null,null,null,{"$f":"'RTU4'!K8","v":0},null,null,null,"RTU5",null,null,null,{"$f":"'RTU5'!K8","v":0},null,null,null,"RTU6",null,null,null,{"$f":"'RTU6'!K8","v":0},null,null,null,"RTU7",null,null,null,{"$f":"'RTU7'!K8","v":0},null,null,null,"RTU8",null,null,null,{"$f":"'RTU8'!K8","v":0}]
[null,"3.  Is there a hail guard installed on unit?  Enter YES or NO.  NOTE: If \"CRITICAL\", unit in top ten hail states."]
[null,"RTU1",null,null,null,{"$f":"'RTU1'!K9","v":"N/A"},null,null,null,"RTU2",null,null,null,{"$f":"'RTU2'!K9","v":0},null,null,null,"RTU3",null,null,null,{"$f":"'RTU3'!K9","v":0},null,null,null,"RTU4",null,null,null,{"$f":"'RTU4'!K9","v":0},null,null,null,"RTU5",null,null,null,{"$f":"'RTU5'!K9","v":0},null,null,null,"RTU6",null,null,null,{"$f":"'RTU6'!K9","v":0},null,null,null,"RTU7",null,null,null,{"$f":"'RTU7'!K9","v":0},null,null,null,"RTU8",null,null,null,{"$f":"'RTU8'!K9","v":0}]
[null,"4.  Quantify damage/deterioration evaporator coil, and enter value 0% to 100%."]
[null,"RTU1",null,null,null,{"$f":"'RTU1'!K10","v":"N/A"},null,null,null,"RTU2",null,null,null,{"$f":"'RTU2'!K10","v":0},null,null,null,"RTU3",null,null,null,{"$f":"'RTU3'!K10","v":0},null,null,null,"RTU4",null,null,null,{"$f":"'RTU4'!K10","v":0},null,null,null,"RTU5",null,null,null,{"$f":"'RTU5'!K10","v":0},null,null,null,"RTU6",null,null,null,{"$f":"'RTU6'!K10","v":0},null,null,null,"RTU7",null,null,null,{"$f":"'RTU7'!K10","v":0},null,null,null,"RTU8",null,null,null,{"$f":"'RTU8'!K10","v":0}]
[null,"5.  Check for power exhaust at AC units greater than ten tons.  If no power exhaust, enter NO.  If there is a power exhaust enter YES"]
[null,"RTU1",null,null,null,{"$f":"'RTU1'!K11","v":"N/A"},null,null,null,"RTU2",null,null,null,{"$f":"'RTU2'!K11","v":"N/A"},null,null,null,"RTU3",null,null,null,{"$f":"'RTU3'!K11","v":0},null,null,null,"RTU4",null,null,null,{"$f":"'RTU4'!K11","v":"N/A"},null,null,null,"RTU5",null,null,null,{"$f":"'RTU5'!K11","v":0},null,null,null,"RTU6",null,null,null,{"$f":"'RTU6'!K11","v":0},null,null,null,"RTU7",null,null,null,{"$f":"'RTU7'!K11","v":0},null,null,null,"RTU8",null,null,null,{"$f":"'RTU8'!K11","v":0}]
[null,"6.  Are there curb adaptors on any of the units?  Enter YES or NO."]
[null,"RTU1",null,null,null,{"$f":"'RTU1'!K12","v":"N/A"},null,null,null,"RTU2",null,null,null,{"$f":"'RTU2'!K12","v":0},null,null,null,"RTU3",null,null,null,{"$f":"'RTU3'!K12","v":0},null,null,null,"RTU4",null,null,null,{"$f":"'RTU4'!K12","v":0},null,null,null,"RTU5",null,null,null,{"$f":"'RTU5'!K12","v":0},null,null,null,"RTU6",null,null,null,{"$f":"'RTU6'!K12","v":0},null,null,null,"RTU7",null,null,null,{"$f":"'RTU7'!K12","v":0},null,null,null,"RTU8",null,null,null,{"$f":"'RTU8'!K12","v":0}]
[null,"7.  If the unit is a dehumidification type unit,  does it have the humidistat device? If so enter YES or NO."]
[null,"RTU1",null,null,null,{"$f":"'RTU1'!K14","v":"N/A"},null,null,null,"RTU2",null,null,null,{"$f":"'RTU2'!K14","v":0},null,null,null,"RTU3",null,null,null,{"$f":"'RTU3'!K14","v":0},null,null,null,"RTU4",null,null,null,{"$f":"'RTU4'!K14","v":0},null,null,null,"RTU5",null,null,null,{"$f":"'RTU5'!K14","v":""},null,null,null,"RTU6",null,null,null,{"$f":"'RTU6'!K14","v":""},null,null,null,"RTU7",null,null,null,{"$f":"'RTU7'!K13","v":0},null,null,null,"RTU8",null,null,null,{"$f":"'RTU8'!K13","v":0}]
[null,"8.  If the unit is a dehumidification type unit,  is the wiring correct from the device to the RTU Master Control Board?  If so enter YES or NO.  Lennox = Two separate shielded ComCables; Trane = One shielded two conductor ComCable."]
[null,"RTU1",null,null,null,{"$f":"'RTU1'!K15","v":0},null,null,null,"RTU2",null,null,null,{"$f":"'RTU2'!K15","v":0},null,null,null,"RTU3",null,null,null,{"$f":"'RTU3'!K15","v":0},null,null,null,"RTU4",null,null,null,{"$f":"'RTU4'!K15","v":0},null,null,null,"RTU5",null,null,null,{"$f":"'RTU5'!K15","v":""},null,null,null,"RTU6",null,null,null,{"$f":"'RTU6'!K15","v":""},null,null,null,"RTU7",null,null,null,{"$f":"'RTU7'!K14","v":0},null,null,null,"RTU8",null,null,null,{"$f":"'RTU8'!K14","v":0}]
[null,"9.  Is a smoke detector present in unit?  If no smoked detector, enter NO.  If there is a smoke detector, enter YES."]
[null,"RTU1",null,null,null,{"$f":"'RTU1'!K16","v":0},null,null,null,"RTU2",null,null,null,{"$f":"'RTU2'!K16","v":0},null,null,null,"RTU3",null,null,null,{"$f":"'RTU3'!K16","v":0},null,null,null,"RTU4",null,null,null,{"$f":"'RTU4'!K16","v":0},null,null,null,"RTU5",null,null,null,{"$f":"'RTU5'!K16","v":0},null,null,null,"RTU6",null,null,null,{"$f":"'RTU6'!K16","v":0},null,null,null,"RTU7",null,null,null,{"$f":"'RTU7'!K15","v":0},null,null,null,"RTU8",null,null,null,{"$f":"'RTU8'!K15","v":0}]
[null,"10.  Is the smoke detector inlet sampling tube capped?  If not capped, enter NO.  If capped enter YES."]
[null,"RTU1",null,null,null,{"$f":"'RTU1'!K17","v":""},null,null,null,"RTU2",null,null,null,{"$f":"'RTU2'!K17","v":""},null,null,null,"RTU3",null,null,null,{"$f":"'RTU3'!K17","v":""},null,null,null,"RTU4",null,null,null,{"$f":"'RTU4'!K17","v":""},null,null,null,"RTU5",null,null,null,{"$f":"'RTU5'!K17","v":""},null,null,null,"RTU6",null,null,null,{"$f":"'RTU6'!K17","v":""},null,null,null,"RTU7",null,null,null,{"$f":"'RTU7'!K16","v":""},null,null,null,"RTU8",null,null,null,{"$f":"'RTU8'!K16","v":"N/A"}]
[null,"11.  Check smoke detector module light. If light RED or an AMBER color.  If either color, enter YES, and If not enter NO."]
[null,"RTU1",null,null,null,{"$f":"'RTU1'!K18","v":""},null,null,null,"RTU2",null,null,null,{"$f":"'RTU2'!K18","v":""},null,null,null,"RTU3",null,null,null,{"$f":"'RTU3'!K18","v":""},null,null,null,"RTU4",null,null,null,{"$f":"'RTU4'!K18","v":""},null,null,null,"RTU5",null,null,null,{"$f":"'RTU5'!K18","v":""},null,null,null,"RTU6",null,null,null,{"$f":"'RTU6'!K18","v":""},null,null,null,"RTU7",null,null,null,{"$f":"'RTU7'!K17","v":""},null,null,null,"RTU8",null,null,null,{"$f":"'RTU8'!K17","v":"N/A"}]
[null,"12.  Is smoke detector dust plugs capped?  If capped, enter YES, and if not enter NO."]
[null,"RTU1",null,null,null,{"$f":"'RTU1'!K19","v":""},null,null,null,"RTU2",null,null,null,{"$f":"'RTU2'!K19","v":""},null,null,null,"RTU3",null,null,null,{"$f":"'RTU3'!K19","v":""},null,null,null,"RTU4",null,null,null,{"$f":"'RTU4'!K19","v":""},null,null,null,"RTU5",null,null,null,{"$f":"'RTU5'!K19","v":""},null,null,null,"RTU6",null,null,null,{"$f":"'RTU6'!K19","v":""},null,null,null,"RTU7",null,null,null,{"$f":"'RTU7'!K18","v":""},null,null,null,"RTU8",null,null,null,{"$f":"'RTU8'!K18","v":"N/A"}]
[null,"13.  Identify any damage to the blower.  If DAMAGE found, enter YES and if not enter NO.  Describe issue in Miscellaneous notes."]
[null,"RTU1",null,null,null,{"$f":"'RTU1'!K20","v":"N/A"},null,null,null,"RTU2",null,null,null,{"$f":"'RTU2'!K20","v":0},null,null,null,"RTU3",null,null,null,{"$f":"'RTU3'!K20","v":0},null,null,null,"RTU4",null,null,null,{"$f":"'RTU4'!K20","v":0},null,null,null,"RTU5",null,null,null,{"$f":"'RTU5'!K20","v":0},null,null,null,"RTU6",null,null,null,{"$f":"'RTU6'!K20","v":0},null,null,null,"RTU7",null,null,null,{"$f":"'RTU7'!K19","v":0},null,null,null,"RTU8",null,null,null,{"$f":"'RTU8'!K19","v":0}]
[null,"14.  Is blank plate secured or missing on B-cabinets?  If secured, enter YES and if not enter NO. If blank plate is missing, enter M."]
[null,"RTU1",null,null,null,{"$f":"'RTU1'!K21","v":"N/A"},null,null,null,"RTU2",null,null,null,{"$f":"'RTU2'!K21","v":"N/A"},null,null,null,"RTU3",null,null,null,{"$f":"'RTU3'!K21","v":0},null,null,null,"RTU4",null,null,null,{"$f":"'RTU4'!K21","v":"N/A"},null,null,null,"RTU5",null,null,null,{"$f":"'RTU5'!K21","v":0},null,null,null,"RTU6",null,null,null,{"$f":"'RTU6'!K21","v":0},null,null,null,"RTU7",null,null,null,{"$f":"'RTU7'!K20","v":0},null,null,null,"RTU8",null,null,null,{"$f":"'RTU8'!K20","v":0}]
[null,"15.  Is ductwork lined?  If ductwork is lined, is it intact and undamaged?  If so, enter I.  If ductwork damaged and/or deteriorating, enter D.  If ductwork is not lined, enter NO."]
[null,"RTU1",null,null,null,{"$f":"'RTU1'!K22","v":"N/A"},null,null,null,"RTU2",null,null,null,{"$f":"'RTU2'!K22","v":0},null,null,null,"RTU3",null,null,null,{"$f":"'RTU3'!K22","v":0},null,null,null,"RTU4",null,null,null,{"$f":"'RTU4'!K22","v":0},null,null,null,"RTU5",null,null,null,{"$f":"'RTU5'!K22","v":0},null,null,null,"RTU6",null,null,null,{"$f":"'RTU6'!K22","v":0},null,null,null,"RTU7",null,null,null,{"$f":"'RTU7'!K21","v":0},null,null,null,"RTU8",null,null,null,{"$f":"'RTU8'!K21","v":0}]
[null,"16. Are turning vanes present in the supply ducts of the units?  If turning vanes present enter YES and if not enter NO."]
[null,"RTU1",null,null,null,{"$f":"'RTU1'!K23","v":"N/A"},null,null,null,"RTU2",null,null,null,{"$f":"'RTU2'!K23","v":0},null,null,null,"RTU3",null,null,null,{"$f":"'RTU3'!K23","v":0},null,null,null,"RTU4",null,null,null,{"$f":"'RTU4'!K23","v":0},null,null,null,"RTU5",null,null,null,{"$f":"'RTU5'!K23","v":0},null,null,null,"RTU6",null,null,null,{"$f":"'RTU6'!K23","v":0},null,null,null,"RTU7",null,null,null,{"$f":"'RTU7'!K22","v":0},null,null,null,"RTU8",null,null,null,{"$f":"'RTU8'!K22","v":0}]
[null,"17. Are turning vanes single or double thickness?  If turning vanes double, enter D and if single enter S."]
[null,"RTU1",null,null,null,{"$f":"'RTU1'!K24","v":"N/A"},null,null,null,"RTU2",null,null,null,{"$f":"'RTU2'!K24","v":""},null,null,null,"RTU3",null,null,null,{"$f":"'RTU3'!K24","v":""},null,null,null,"RTU4",null,null,null,{"$f":"'RTU4'!K24","v":""},null,null,null,"RTU5",null,null,null,{"$f":"'RTU5'!K24","v":""},null,null,null,"RTU6",null,null,null,{"$f":"'RTU6'!K24","v":""},null,null,null,"RTU7",null,null,null,{"$f":"'RTU7'!K23","v":""},null,null,null,"RTU8",null,null,null,{"$f":"'RTU8'!K23","v":"N/A"}]
[null,"18. Is canvas connector missing or damaged?  If no connector present, enter NO and if present enter YES.  If connector damaged enter D."]
[null,"RTU1",null,null,null,{"$f":"'RTU1'!K25","v":"N/A"},null,null,null,"RTU2",null,null,null,{"$f":"'RTU2'!K25","v":0},null,null,null,"RTU3",null,null,null,{"$f":"'RTU3'!K25","v":0},null,null,null,"RTU4",null,null,null,{"$f":"'RTU4'!K25","v":0},null,null,null,"RTU5",null,null,null,{"$f":"'RTU5'!K25","v":0},null,null,null,"RTU6",null,null,null,{"$f":"'RTU6'!K25","v":0},null,null,null,"RTU7",null,null,null,{"$f":"'RTU7'!K24","v":0},null,null,null,"RTU8",null,null,null,{"$f":"'RTU8'!K24","v":0}]
[null,"19.  If turning vanes not present, is drop radiused?  If so, does radius equal the width of the duct? If radius does not equal duct width, enter NO and if does enter YES."]
[null,"RTU1",null,null,null,{"$f":"'RTU1'!K26","v":"N/A"},null,null,null,"RTU2",null,null,null,{"$f":"'RTU2'!K26","v":""},null,null,null,"RTU3",null,null,null,{"$f":"'RTU3'!K26","v":""},null,null,null,"RTU4",null,null,null,{"$f":"'RTU4'!K26","v":""},null,null,null,"RTU5",null,null,null,{"$f":"'RTU5'!K26","v":""},null,null,null,"RTU6",null,null,null,{"$f":"'RTU6'!K26","v":""},null,null,null,"RTU7",null,null,null,{"$f":"'RTU7'!K25","v":""},null,null,null,"RTU8",null,null,null,{"$f":"'RTU8'!K25","v":0}]
[null,"20.  Check economizer setting at Master Control Boad.  If economizer set to zero, TAB to set the economizer position to the TAB sticker setpoint or damper shaft marking (If it exists) or to 20% open should no sticker or shaft marking exists.  If economizer doesn't stroke to desired position, enter \"D\" for deficiency.  If no deficiency enter ND."]
[null,"RTU1",null,null,null,{"$f":"'RTU1'!K27","v":0},null,null,null,"RTU2",null,null,null,{"$f":"'RTU2'!K27","v":0},null,null,null,"RTU3",null,null,null,{"$f":"'RTU3'!K27","v":0},null,null,null,"RTU4",null,null,null,{"$f":"'RTU4'!K27","v":0},null,null,null,"RTU5",null,null,null,{"$f":"'RTU5'!K27","v":0},null,null,null,"RTU6",null,null,null,{"$f":"'RTU6'!K27","v":0},null,null,null,"RTU7",null,null,null,{"$f":"'RTU7'!K26","v":0},null,null,null,"RTU8",null,null,null,{"$f":"'RTU8'!K26","v":0}]
[null,"21.  Provide condensation pipe size.  Minimum 1\" at playland unit, and 1.25\" at all other units.  NOTE: DROP DOWN MENUS FOR PIPE SIZE."]
[null,"RTU1",null,null,null,{"$f":"'RTU1'!K28","v":0},null,null,null,"RTU2",null,null,null,{"$f":"'RTU2'!K28","v":0},null,null,null,"RTU3",null,null,null,{"$f":"'RTU3'!K28","v":0},null,null,null,"RTU4",null,null,null,{"$f":"'RTU4'!K28","v":0},null,null,null,"RTU5",null,null,null,{"$f":"'RTU5'!K28","v":0},null,null,null,"RTU6",null,null,null,{"$f":"'RTU6'!K28","v":0},null,null,null,"RTU7",null,null,null,{"$f":"'RTU7'!K27","v":0},null,null,null,"RTU8",null,null,null,{"$f":"'RTU8'!K27","v":0}]
[null,"22.  Incorrect MFR of devices or equipment installed that does not match CFA specifications.  If incorrect manufacturer devices found, enter YES and decribe deficiency in miscellaneous notes.  If not enter NO."]
[null,"RTU1",null,null,null,{"$f":"'RTU1'!K29","v":"N/A"},null,null,null,"RTU2",null,null,null,{"$f":"'RTU2'!K29","v":0},null,null,null,"RTU3",null,null,null,{"$f":"'RTU3'!K29","v":0},null,null,null,"RTU4",null,null,null,{"$f":"'RTU4'!K29","v":0},null,null,null,"RTU5",null,null,null,{"$f":"'RTU5'!K29","v":0},null,null,null,"RTU6",null,null,null,{"$f":"'RTU6'!K29","v":0},null,null,null,"RTU7",null,null,null,{"$f":"'RTU7'!K28","v":0},null,null,null,"RTU8",null,null,null,{"$f":"'RTU8'!K28","v":0}]
[null,"ROOFTOP EXHAUST FANS/THERMOSTATS"]
[null,"1.  Incorrect MFR of devices or equipment installed that does not match CFA specifications.  If incorrect manufacturer devices found, enter YES and decribe deficiency in miscellaneous note E#.  If not enter NO."]
[null,"EF1",null,null,{"$f":"'EF Thermostat'!$C$6","v":0},null,null,"EF2",null,null,{"$f":"'EF Thermostat'!$E$6","v":0},null,null,"EF3",null,null,{"$f":"'EF Thermostat'!$G$6","v":0},null,null,"EF4",null,null,{"$f":"'EF Thermostat'!$I$6","v":0},null,null,{"$f":"'EF Thermostat'!$I$6","v":0}]
[null,"2.  Loose or missing access doors or gasketes on the grease ductwork.  Grease exhaust duct dampers - Halton Kitchen Volume Damper.  If issues found with access doors, enter YES and describe in miscelleneous note E#a.  If no issues, enter NO.  If gaskets missing enter MG."]
[null,"EF1",null,null,{"$f":"'EF Thermostat'!$C$8","v":0},null,null,"EF2",null,null,{"$f":"'EF Thermostat'!$E$8","v":0},null,null,"EF3",null,null,{"$f":"'EF Thermostat'!$G$8","v":0},null,null,"EF4",null,null,{"$f":"'EF Thermostat'!$I$8","v":0},null,null,{"$f":"IF(ISBLANK($E$14),\"N/A\",\"\")","v":"N/A"}]
[null,"3.  Exhaust System - Wrong HP motor in rooftop exhaust equipment.  If incorrect HP, enter YES and if correct enter NO."]
[null,"EF1",null,null,{"$f":"'EF Thermostat'!$C$10","v":0},null,null,"EF2",null,null,{"$f":"'EF Thermostat'!$E$10","v":0},null,null,"EF3",null,null,{"$f":"'EF Thermostat'!$G$10","v":0},null,null,"EF4",null,null,{"$f":"'EF Thermostat'!$I$10","v":0}]
[null,"4.  Does bathroom exhaust fan duct have a liner?  Enter YES or NO.",null,null,null,null,null,null,null,null,null,null,null,null,null,null,null,null,null,null,null,null,null,null,null,null,null,null,null,null,null,null,null,null,null,null,null,null,null,{"$f":"'EF Thermostat'!K11","v":0}]
[null,"5.  Record model number of Suncoast Panel",null,null,null,null,null,null,null,null,null,null,null,null,null,null,null,null,null,null,null,null,null,null,null,null,null,{"$f":"'EF Thermostat'!H12","v":0}]
[null,"6.  Record serial number of Suncoast Panel.",null,null,null,null,null,null,null,null,null,null,null,null,null,null,null,null,null,null,null,null,null,null,null,null,null,{"$f":"'EF Thermostat'!H13","v":0}]
[null,"7.  Is there a HES control panel visible?  Enter YES or NO."]
[null,"8.  Are thermostats Robert Shaw (Gray Display) or Network (Blue Display)? Enter \"RS\", \"NW\" for Robert Shaw and Network respectively.  If thermostat not Robert Shaw or Network enter NO."]
[null,"AC1",null,null,null,null,null,null,null,{"$f":"'EF Thermostat'!C16","v":0},null,null,null,null,null,null,null,"A2",null,null,null,null,null,null,null,{"$f":"'EF Thermostat'!E16","v":0},null,null,null,null,null,null,null,"AC3",null,null,null,null,null,null,null,{"$f":"'EF Thermostat'!G16","v":0},null,null,null,null,null,null,null,"AC4",null,null,null,null,null,null,null,{"$f":"'EF Thermostat'!I16","v":"RS"},null,null,null,null,null,null,null,null,null,null,null,null,null,null,null,null,null,null,null,null,null,null,null,null,20]
[null,"AC5",null,null,null,null,null,null,null,{"$f":"'EF Thermostat'!K16","v":0},null,null,null,null,null,null,null,"AC6",null,null,null,null,null,null,null,{"$f":"'EF Thermostat'!C17","v":0},null,null,null,null,null,null,null,"AC7",null,null,null,null,null,null,null,{"$f":"'EF Thermostat'!E17","v":0},null,null,null,null,null,null,null,"AC8",null,null,null,null,null,null,null,{"$f":"'EF Thermostat'!G17","v":0},null,null,null,null,null,null,null,null,null,null,null,null,null,null,null,null,null,null,null,null,null,null,null,null,{"$f":"COUNTA(B73:BO74)","v":16}]
[null,"MISCELLANEOUS NOTES"]
[null,"RTU 1",null,null,{"$f":"'RTU1'!B31","v":0}]
[null,null,null,null,{"$f":"'RTU1'!B32","v":0}]
[null,null,null,null,{"$f":"'RTU1'!B33","v":0}]
[null,"RTU 2"]
[null,null,null,null,{"$f":"'RTU2'!B32","v":0}]
[null,null,null,null,{"$f":"'RTU2'!B33","v":0}]
[null,"RTU 3",null,null,{"$f":"'RTU3'!B31","v":0}]
[null,null,null,null,{"$f":"'RTU3'!B32","v":0}]
[null,null,null,null,{"$f":"'RTU3'!B33","v":0}]
[null,"RTU 4",null,null,{"$f":"'RTU4'!B31","v":0}]
[null,null,null,null,{"$f":"'RTU4'!B32","v":0}]
[null,null,null,null,{"$f":"'RTU4'!B33","v":0}]
[null,"RTU 5",null,null,{"$f":"'RTU5'!B31","v":0}]
[null,null,null,null,{"$f":"'RTU5'!B32","v":0}]
[null,null,null,null,{"$f":"'RTU5'!B33","v":0}]
[null,"RTU 6",null,null,{"$f":"'RTU6'!B31","v":0}]
[]
[]
[null,"MISC NOTES"]
[]
[]
[]
[]
[null,null,"DEVELOPED LENGTH ______ ' - 2018 INTERNATIONAL FUEL GAS CODE - BRANCH LENGTH METHOD - TOTAL BTU'S ",null,null,null,null,null,null,null,null,null,null,null,null,null,null,null,null,null,null,null,null,null,null,null,null,null,null,null,null,null,null,null,null,null,null,null,null,null,null,null,null,null,null,null,null,null,null,null,null,null,null,null,null,null,null,null,null,null,null,null,null,null,null,null,null,null,null,null,null,null,null,null,null,null,null,null,null,null,null,null,null,null,null,null,null,null,null,null,null,null,"RTU1 M#","LGH150",{"$f":"(IF(ISBLANK(CP99),\"\",VALUE(IF(MID(CP99,4,3)=\"036\",\"65,000\",IF(MID(CP99,4,3)<\"090\",\"125,000\",IF(MID(CP99,4,3)>\"150\",\"480,000\",\"240,000\"))))))","v":240000}]
[null,null,null,null,null,null,null,null,null,null,null,null,null,null,null,null,null,null,null,null,null,null,null,null,null,null,null,null,null,null,null,null,null,null,null,null,null,null,null,null,null,null,null,null,null,null,null,null,null,null,null,null,null,null,null,null,null,null,null,null,null,null,null,null,null,null,null,null,null,null,null,null,null,null,null,null,null,null,null,null,null,null,null,null,null,null,null,null,null,null,null,null,"RTU2 M#","LGH120",{"$f":"(IF(ISBLANK(CP100),\"\",VALUE(IF(MID(CP100,4,3)=\"036\",\"65,000\",IF(MID(CP100,4,3)<\"090\",\"125,000\",IF(MID(CP100,4,3)>\"150\",\"480,000\",\"240,000\"))))))","v":240000}]
[null,null,null,"BRANCH PIPING (B#)",null,null,null,null,null,null,null,null,null,null,null,null,null,null,null,null,null,null,null,null,null,null,null,null,null,null,null,null,"DROP PIPING (D#)",null,null,null,null,null,null,null,null,null,null,null,null,null,null,null,null,null,null,null,null,null,null,null,null,null,null,null,null,null,null,null,null,null,null,null,null,null,null,null,null,null,null,null,null,null,null,null,null,null,null,null,null,null,null,null,null,null,null,null,"RTU3 M#","LGH120",240000]
[null,null,null,"DESCRIPTION",null,null,null,null,null,null,"BRANCH LENGTH/SIZE",null,null,null,null,null,null,null,null,null,null,null,null,null,null,null,null,null,null,null,null,null,"DESCRIPTION",null,null,null,null,null,null,null,null,null,null,null,null,null,"DROP  LENGTH/SIZE",null,null,null,null,null,null,null,null,null,null,null,null,null,null,null,null,null,null,null,null,null,null,null,"PIPE SIZE",null,null,null,"*OUTSIDE DIAMETER",null,null,null,null,null,null,null,null,null,null,null,null,null,null,null,null,null,"RTU4 M#","LGH092",240000]
[null,null,null,"GAS LINE",null,null,null,null,null,null,"LENGTH",null,null,null,null,"AS-BUILT",null,null,null,null,"DESIGN",null,null,null,null,"CALC",null,null,null,null,null,null,"DROP  ",null,null,null,"GAS LINE",null,null,null,null,"DEVICE",null,null,null,null,"LENGTH",null,null,null,null,"AS-BUILT",null,null,null,null,null,"DESIGN",null,null,null,null,"CALC",null,null,null,null,null,null,null,null,null,null,null,null,null,null,null,null,null,null,null,null,null,null,null,null,null,null,null,null,null,"RTU5 M#",null,""]
[null,null,null,null,null,null,null,null,null,null,"(ft)",null,null,null,null,"(in)",null,null,null,null,"(in)",null,null,null,null,"(in)",null,null,null,null,null,null,null,null,null,null,null,null,null,null,null,null,null,null,null,null,"(ft)",null,null,null,null,"(in)",null,null,null,null,null,"(in)",null,null,null,null,"(in)",null,null,null,null,null,null,null,"1/2\"",null,null,null,"7/8\"",null,null,null,null,null,null,null,null,null,null,null,null,null,null,null,null,null,"RTU6 M#",null,""]
[null,null,null," Meter to B1",null,null,null,null,null,null,null,null,null,null,null,null,null,null,null,null,null,null,null,null,null,null,null,null,null,null,null,null,null,null,null,null,null,null,null,null,null,null,null,null,null,null,null,null,null,null,null,null,null,null,null,null,null,null,null,null,null,null,null,null,null,null,null,null,null,null,"3/4\"",null,null,null,"1\"",null,null,null,null,null,null,null,null,null,null,null,null,null,null,null,null,null,"WH",null,150000]
[null,null,null,"B1 to B2",null,null,null,null,null,null,null,null,null,null,null,null,null,null,null,null,null,null,null,null,null,null,null,null,null,null,null,null,"D1",null,null,null,"B2 to",null,null,null,null,"RTU 1",null,null,null,null,null,null,null,null,null,null,null,null,null,null,null,null,null,null,null,null,null,null,null,null,null,null,null,null,"1\"",null,null,null,"1-5/16\"",null,null,null,null,null,null,null,null,null,null,null,null,null,null,null,null,null,"DLOC"]
[null,null,null,"D2",null,null,null,null,null,null,null,null,null,null,null,null,null,null,null,null,null,null,null,null,null,null,null,null,null,null,null,null,"D2",null,null,null,"B2 to",null,null,null,null,"WH",null,null,null,null,null,null,null,null,null,null,null,null,null,null,null,null,null,null,null,null,null,null,null,null,null,null,null,null,"1-1/4\"",null,null,null,"1-5/8\"",null,null,null,null,null,null,null,null,null,null,null,null,null,null,null,null,null,"Patio Htrs."]
[null,null,null,"B1 to B3",null,null,null,null,null,null,null,null,null,null,null,null,null,null,null,null,null,null,null,null,null,null,null,null,null,null,null,null,"D3",null,null,null,"B3 to",null,null,null,null,"RTU 2",null,null,null,null,null,null,null,null,null,null,null,null,null,null,null,null,null,null,null,null,null,null,null,null,null,null,null,null,"1-1/2\"",null,null,null,"1-7/8\"",null,null,null,null,null,null,null,null,null,null,null,null,null,null,null,null,null,"OMDC",null,336000]
[null,null,null,"B3 to B4",null,null,null,null,null,null,null,null,null,null,null,null,null,null,null,null,null,null,null,null,null,null,null,null,null,null,null,null,"D4",null,null,null,"B4 to",null,null,null,null,"RTU 3",null,null,null,null,null,null,null,null,null,null,null,null,null,null,null,null,null,null,null,null,null,null,null,null,null,null,null,null,"2\"",null,null,null,"2-3/8\"",null,null,null,null,null,null,null,null,null,null,null,null,null,null,null,null,null,null,null,{"$f":"SUM(CQ99:CQ108)","v":1446000}]
[null,null,null,"D3",null,null,null,null,null,null,null,null,null,null,null,null,null,null,null,null,null,null,null,null,null,null,null,null,null,null,null,null,"D5",null,null,null,"B5 to",null,null,null,null,"RTU 4",null,null,null,null,null,null,null,null,null,null,null,null,null,null,null,null,null,null,null,null,null,null,null,null,null,null,null,null,"2-1/2\"",null,null,null,"2-7/8\""]
[null,null,null,null,null,null,null,null,null,null,null,null,null,null,null,null,null,null,null,null,null,null,null,null,null,null,null,null,null,null,null,null,null,null,null,null,null,null,null,null,null,null,null,null,null,null,null,null,null,null,null,null,null,null,null,null,null,null,null,null,null,null,null,null,null,null,null,null,null,null,"3'",null,null,null,"3-1/2\""]
[null,null,null,null,null,null,null,null,null,null,null,null,null,null,null,null,null,null,null,null,null,null,null,null,null,null,null,null,null,null,null,null,null,null,null,null,null,null,null,null,null,null,null,null,null,null,null,null,null,null,null,null,null,null,null,null,null,null,null,null,null,null,null,null,null,null,null,null,null,null,"3-1/2\"",null,null,null,"4\""]
[null,null,null,null,null,null,null,null,null,null,null,null,null,null,null,null,null,null,null,null,null,null,null,null,null,null,null,null,null,null,null,null,null,null,null,null,null,null,null,null,null,null,null,null,null,null,null,null,null,null,null,null,null,null,null,null,null,null,null,null,null,null,null,null,null,null,null,null,null,null,"4\"",null,null,null,"4-1/2\""]
[null,null,null,null,null,null,null,null,null,null,null,null,null,null,null,null,null,null,null,null,null,null,null,null,null,null,null,null,null,null,null,null,null,null,null,null,null,null,null,null,null,null,null,null,null,null,null,null,null,null,null,null,null,null,null,null,null,null,null,null,null,null,null,null,null,null,null,null,null,null,"*Approximate"]
[]
[]
[]
[]
[]
[]
[]
[]
[]
[]
[]
[]
[]
[]
[]
[]
[]
[]
[]
[]
[]
[]
[]
[]
[]
[]
[]
[]
[]
[]
[]
[]
[]
[]
[]
[]
[]
[]
[]
[]
[]
[]
[]
[]
[null,"INSERT 1",null,null,null,null,null,null,null,null,null,null,null,null,null,null,null,null,null,null,null,null,null,null,null,null,null,null,null,null,null,null,null,null,"INSERT 2"]
[]
[]
[]
[]
[]
[]
[]
[]
[]
[]
[]
[]
[]
[]
[]
[]
[]
[]
[]
[]
[]
[]
[]
[null,"INSERT 3",null,null,null,null,null,null,null,null,null,null,null,null,null,null,null,null,null,null,null,null,null,null,null,null,null,null,null,null,null,null,null,null,"INSERT 4"]
[]
[]
[]
[]
[]
[]
[]
[]
[]
[]
[]
[]
[]
[]
[]
[]
[]
[]
[]
[]
[]
[]
[]
[null,"INSERT 5",null,null,null,null,null,null,null,null,null,null,null,null,null,null,null,null,null,null,null,null,null,null,null,null,null,null,null,null,null,null,null,null,"INSERT 6"]
[]
[]
[]
[]
[]
[]
[]
[]
[]
[]
[]
[]
[]
[]
[]
[]
[]
[]
[]
[]
[]
[]
[]
[null,"INSERT 7",null,null,null,null,null,null,null,null,null,null,null,null,null,null,null,null,null,null,null,null,null,null,null,null,null,null,null,null,null,null,null,null,"INSERT 8"]
[]
[]
[]
[]
[]
[]
[]
[]
[]
[]
[]
[]
[]
[]
[]
[]
[]
[]
[]
[]
[]
[]
[]
[null,"INSERT 9",null,null,null,null,null,null,null,null,null,null,null,null,null,null,null,null,null,null,null,null,null,null,null,null,null,null,null,null,null,null,null,null,"INSERT 10"]
[]
[]
[]
[]
[]
[]
[]
[]
[]
[]
[]
[]
[]
[]
[]
[]
[]
[]
[]
[]
[]
[]
[]
[null,"INSERT 11",null,null,null,null,null,null,null,null,null,null,null,null,null,null,null,null,null,null,null,null,null,null,null,null,null,null,null,null,null,null,null,null,"INSERT 12"]

{"sheet":"HVAC SCOPE","index":2,"n_rows":32,"n_cols":127,"rows_kept":32,"cut":false,"hidden":true,"merged":[[18,103,18,108],[8,103,8,108],[9,103,9,108],[10,103,10,108],[11,103,11,108],[12,103,12,108],[13,103,13,108],[14,103,14,108],[15,103,15,108],[16,103,16,108],[1,97,1,110],[2,97,2,110],[3,103,3,105],[4,103,4,105],[5,103,5,104],[6,97,6,108],[7,97,7,101],[7,103,7,108],[17,103,17,108],[8,97,8,101],[14,97,14,101],[16,97,16,101],[15,97,15,101],[17,97,17,101],[1,65,1,78],[2,65,2,78],[3,71,3,73],[4,71,4,73],[5,71,5,72],[6,65,6,76],[7,65,7,69],[7,71,7,76],[5,68,5,69],[27,119,27,124],[28,119,28,124],[29,119,29,124],[30,119,30,124],[9,49,9,53],[9,81,9,85],[9,97,9,101],[10,81,10,85],[10,97,10,101],[9,65,9,69],[26,97,26,101],[16,55,16,60],[17,55,17,60],[18,55,18,60],[19,55,19,60],[20,55,20,60],[13,65,13,69],[13,81,13,85],[13,97,13,101],[12,65,12,69],[12,81,12,85],[12,97,12,101],[19,97,19,101],[26,81,26,85],[27,113,27,117],[27,81,27,85],[27,71,27,76],[28,71,28,76],[27,87,27,92],[27,49,27,53],[27,65,27,69],[27,23,27,28],[30,81,30,85],[30,97,30,101],[30,113,30,117],[28,97,28,101],[28,113,28,117],[29,97,29,101],[29,113,29,117],[29,71,29,76],[30,71,30,76],[28,81,28,85],[28,87,28,92],[29,87,29,92],[30,87,30,92],[28,103,28,108],[29,103,29,108],[30,103,30,108],[30,33,30,37],[30,49,30,53],[30,65,30,69],[26,55,26,60],[27,55,27,60],[30,55,30,60],[26,17,26,21],[26,33,26,37],[26,49,26,53],[29,17,29,21],[29,33,29,37],[29,49,29,53],[29,65,29,69],[29,23,29,28],[30,23,30,28],[28,39,28,44],[29,39,29,44],[30,39,30,44],[28,17,28,21],[28,33,28,37],[28,49,28,53],[28,55,28,60],[29,55,29,60],[13,113,13,117],[26,65,26,69],[26,113,26,117],[21,55,21,60],[22,55,22,60],[23,55,23,60],[24,55,24,60],[25,55,25,60],[13,71,13,76],[14,71,14,76],[15,71,15,76],[16,71,16,76],[17,71,17,76],[18,71,18,76],[19,71,19,76],[20,71,20,76],[15,65,15,69],[15,81,15,85],[14,65,14,69],[14,81,14,85],[17,65,17,69],[17,81,17,85],[16,65,16,69],[16,81,16,85],[12,113,12,117],[12,33,12,37],[12,49,12,53],[12,71,12,76],[12,87,12,92],[11,65,11,69],[10,49,10,53],[10,65,10,69],[10,119,10,124],[11,119,11,124],[12,119,12,124],[11,81,11,85],[11,97,11,101],[10,1,10,5],[93,0,94,0],[91,0,92,0],[89,0,90,0],[87,0,88,0],[84,0,85,0],[118,0,119,0],[114,0,115,0],[112,0,113,0],[109,0,110,0],[106,0,107,0],[102,0,103,0],[99,0,100,0],[97,0,98,0],[95,0,96,0],[68,0,69,0],[70,0,71,0],[74,0,75,0],[40,0,41,0],[43,0,44,0],[45,0,46,0],[47,0,48,0],[49,0,50,0],[51,0,52,0],[14,49,14,53],[8,49,8,53],[24,1,24,5],[14,1,14,5],[13,1,13,5],[12,1,12,5],[17,1,17,5],[19,1,19,5],[16,1,16,5],[18,1,18,5],[20,1,20,5],[11,33,11,37],[11,49,11,53],[13,33,13,37],[13,49,13,53],[15,33,15,37],[15,49,15,53],[16,17,16,21],[16,33,16,37],[17,17,17,21],[17,33,17,37],[17,49,17,53],[16,49,16,53],[11,1,11,5],[57,0,58,0],[62,0,63,0],[65,0,66,0],[137,0,138,0],[135,0,136,0],[133,0,134,0],[131,0,132,0],[129,0,130,0],[126,0,127,0],[19,103,19,108],[23,33,23,37],[23,49,23,53],[23,65,23,69],[23,81,23,85],[23,97,23,101],[25,71,25,76],[26,71,26,76],[31,97,31,108],[26,39,26,44],[27,39,27,44],[27,97,27,101],[28,65,28,69],[29,81,29,85],[19,87,19,92],[20,87,20,92],[21,87,21,92],[22,103,22,108],[23,103,23,108],[24,103,24,108],[25,103,25,108],[26,103,26,108],[27,103,27,108],[31,33,31,46],[8,65,8,69],[8,71,8,76],[5,84,5,85],[5,87,5,88],[6,81,6,92],[7,81,7,85],[7,87,7,92],[8,87,8,92],[160,0,161,0],[156,0,157,0],[154,0,155,0],[151,0,152,0],[148,0,149,0],[143,0,144,0],[141,0,142,0],[139,0,140,0],[31,1,31,14],[28,7,28,12],[29,7,29,12],[30,7,30,12],[32,1,32,14],[32,17,32,30],[53,0,54,0],[55,0,56,0],[9,71,9,76],[10,71,10,76],[11,71,11,76],[9,87,9,92],[10,87,10,92],[11,87,11,92],[13,87,13,92],[8,81,8,85],[14,87,14,92],[15,87,15,92],[16,87,16,92],[17,87,17,92],[18,49,18,53],[18,97,18,101],[18,65,18,69],[18,81,18,85],[19,17,19,21],[19,33,19,37],[19,49,19,53],[19,65,19,69],[19,81,19,85],[18,23,18,28],[19,23,19,28],[18,87,18,92],[22,119,22,124],[23,119,23,124],[20,113,20,117],[21,17,21,21],[21,33,21,37],[21,49,21,53],[21,65,21,69],[21,81,21,85],[21,97,21,101],[21,113,21,117],[20,17,20,21],[20,33,20,37],[20,65,20,69],[20,81,20,85],[21,71,21,76],[20,103,20,108],[21,103,21,108],[20,49,20,53],[20,97,20,101],[22,97,22,101],[23,87,23,92],[22,87,22,92],[22,113,22,117],[23,17,23,21],[23,113,23,117],[22,17,22,21],[22,33,22,37],[22,49,22,53],[22,65,22,69],[22,81,22,85],[22,71,22,76],[23,71,23,76],[24,49,24,53],[24,65,24,69],[24,81,24,85],[24,71,24,76],[24,113,24,117],[24,119,24,124],[25,119,25,124],[26,119,26,124],[25,113,25,117],[24,97,24,101],[24,87,24,92],[25,87,25,92],[26,87,26,92],[25,1,25,5],[25,17,25,21],[25,33,25,37],[25,49,25,53],[25,65,25,69],[25,81,25,85],[25,97,25,101],[25,39,25,44],[32,33,32,46],[27,17,27,21],[33,97,33,108],[34,97,34,108],[31,113,31,124],[32,113,32,124],[33,113,33,124],[34,113,34,124],[31,49,31,60],[32,49,32,60],[33,49,33,60],[34,49,34,60],[31,65,31,76],[32,65,32,76],[33,65,33,76],[34,65,34,76],[31,81,31,92],[32,81,32,92],[33,81,33,92],[34,81,34,92],[34,17,34,30],[31,17,31,30],[32,97,32,108],[30,17,30,21],[4,4,4,6],[8,1,8,5],[3,23,3,25],[3,18,3,19],[3,20,3,22],[4,18,4,19],[4,20,4,22],[4,34,4,35],[4,36,4,38],[7,1,7,5],[5,23,5,24],[8,17,8,21],[7,17,7,21],[8,33,8,37],[7,23,7,28],[8,23,8,28],[3,84,3,86],[4,82,4,83],[1,1,1,14],[2,1,2,14],[3,7,3,9],[4,7,4,9],[3,39,3,41],[4,39,4,41],[3,114,3,115],[4,114,4,115],[3,98,3,99],[3,100,3,102],[4,98,4,99],[1,33,1,46],[2,33,2,46],[4,84,4,86],[1,17,1,30],[2,17,2,30],[1,81,1,94],[2,81,2,94],[3,87,3,89],[4,87,4,89],[4,100,4,102],[3,66,3,67],[23,1,23,5],[22,1,22,5],[15,1,15,5],[30,1,30,5],[28,1,28,5],[29,1,29,5],[26,1,26,5],[27,1,27,5],[3,82,3,83],[3,68,3,70],[4,66,4,67],[4,68,4,70],[9,1,9,5],[4,23,4,25],[3,34,3,35],[3,36,3,38],[6,1,6,12],[6,17,6,28],[6,33,6,44],[7,33,7,37],[7,39,7,44],[3,2,3,3],[4,2,4,3],[3,4,3,6],[33,1,33,14],[34,1,34,14],[7,7,7,12],[8,7,8,12],[9,7,9,12],[10,7,10,12],[11,7,11,12],[12,7,12,12],[13,7,13,12],[14,7,14,12],[15,7,15,12],[16,7,16,12],[17,7,17,12],[18,7,18,12],[19,7,19,12],[20,7,20,12],[21,7,21,12],[22,7,22,12],[23,7,23,12],[24,7,24,12],[25,7,25,12],[26,7,26,12],[27,7,27,12],[21,1,21,5],[21,23,21,28],[22,23,22,28],[23,23,23,28],[24,23,24,28],[25,23,25,28],[26,23,26,28],[28,23,28,28],[24,17,24,21],[9,23,9,28],[10,23,10,28],[11,23,11,28],[12,23,12,28],[13,23,13,28],[14,23,14,28],[15,23,15,28],[16,23,16,28],[17,23,17,28],[8,39,8,44],[9,39,9,44],[10,39,10,44],[11,39,11,44],[12,39,12,44],[13,39,13,44],[14,39,14,44],[15,39,15,44],[33,17,33,30],[24,33,24,37],[18,17,18,21],[18,33,18,37],[14,17,14,21],[15,17,15,21],[13,17,13,21],[12,17,12,21],[9,17,9,21],[11,17,11,21],[14,33,14,37],[10,17,10,21],[10,33,10,37],[9,33,9,37],[27,33,27,37],[20,23,20,28],[1,49,1,62],[2,49,2,62],[8,55,8,60],[3,55,3,57],[4,55,4,57],[5,55,5,56],[5,58,5,59],[9,55,9,60],[10,55,10,60],[3,50,3,51],[3,52,3,54],[4,50,4,51],[7,49,7,53],[7,55,7,60],[6,49,6,60],[5,52,5,53],[4,52,4,54],[20,119,20,124],[21,119,21,124],[5,119,5,120],[6,113,6,124],[7,113,7,117],[7,119,7,124],[8,119,8,124],[33,33,33,46],[34,33,34,46],[11,55,11,60],[12,55,12,60],[13,55,13,60],[14,55,14,60],[15,55,15,60],[16,39,16,44],[17,39,17,44],[18,39,18,44],[19,39,19,44],[20,39,20,44],[21,39,21,44],[22,39,22,44],[23,39,23,44],[24,39,24,44],[5,39,5,40],[1,113,1,126],[2,113,2,126],[13,119,13,124],[14,119,14,124],[15,119,15,124],[16,119,16,124],[17,119,17,124],[18,119,18,124],[19,119,19,124],[3,116,3,118],[4,116,4,118],[3,119,3,121],[4,119,4,121],[19,113,19,117],[14,113,14,117],[15,113,15,117],[16,113,16,117],[17,113,17,117],[18,113,18,117],[8,113,8,117],[9,113,9,117],[9,119,9,124],[10,113,10,117],[11,113,11,117]]}
[null,6.57,11.43,9.2899999999999991,8.57,16.29,10.57,10.57,10.57,9.43,6.29,9,9.2899999999999991,11.43,14,null,null,6.57,11.43,9.2899999999999991,8.57,16.29,10.57,10.57,10.57,9.43,6.29,9,9.2899999999999991,11.43,14,null,null,6.57,11.43,9.2899999999999991,8.57,16.29,10.57,10.57,10.57,9.43,6.29,9,9.2899999999999991,11.43,14,null,null,6.57,11.43,9.2899999999999991,8.57,16.29,10.57,10.57,10.57,9.43,6.29,9,9.2899999999999991,11.43,14,null,null,6.57,11.43,9.2899999999999991,8.57,16.29,10.57,10.57,10.57,9.43,6.29,9,9.2899999999999991,11.43,14,null,null,6.57,11.43,9.2899999999999991,8.57,16.29,10.57,10.57,10.57,9.43,6.29,9,9.2899999999999991,11.43,14,null,null,6.57,11.43,9.2899999999999991,8.57,16.29,10.57,10.57,10.57,9.43,6.29,9,9.2899999999999991,11.43,14,null,null,6.57,11.43,9.2899999999999991,8.57,16.29,10.57,10.57,10.57,9.43,6.29,9,9.2899999999999991,11.43,14]
[null,"REINVESTMENT CONDITION SURVEY SCOPE OF WORK",null,null,null,null,null,null,null,null,null,null,null,null,null,null,null,"REINVESTMENT CONDITION SURVEY SCOPE OF WORK",null,null,null,null,null,null,null,null,null,null,null,null,null,null,null,"REINVESTMENT CONDITION SURVEY SCOPE OF WORK",null,null,null,null,null,null,null,null,null,null,null,null,null,null,null,"REINVESTMENT CONDITION SURVEY SCOPE OF WORK",null,null,null,null,null,null,null,null,null,null,null,null,null,null,null,"REINVESTMENT CONDITION SURVEY SCOPE OF WORK",null,null,null,null,null,null,null,null,null,null,null,null,null,null,null,"REINVESTMENT CONDITION SURVEY SCOPE OF WORK",null,null,null,null,null,null,null,null,null,null,null,null,null,null,null,"REINVESTMENT CONDITION SURVEY SCOPE OF WORK",null,null,null,null,null,null,null,null,null,null,null,null,null,null,null,"REINVESTMENT CONDITION SURVEY SCOPE OF WORK"]
[null,"ROOFTOP UNIT #ONE",null,null,null,null,null,null,null,null,null,null,null,null,null,null,null,"ROOFTOP UNIT #TWO",null,null,null,null,null,null,null,null,null,null,null,null,null,null,null,"ROOFTOP UNIT #THREE",null,null,null,null,null,null,null,null,null,null,null,null,null,null,null,"ROOFTOP UNIT #FOUR",null,null,null,null,null,null,null,null,null,null,null,null,null,null,null,"ROOFTOP UNIT #FIVE",null,null,null,null,null,null,null,null,null,null,null,null,null,null,null,"ROOFTOP UNIT #SIX",null,null,null,null,null,null,null,null,null,null,null,null,null,null,null,"ROOFTOP UNIT #SEVEN",null,null,null,null,null,null,null,null,null,null,null,null,null,null,null,"ROOFTOP UNIT #EIGHT"]
[null,"UNIT #","NAME",null,"ADDRESS",null,null,"CITY",null,null,"STATE","COUNTY","IECC ZONE","SERIAL #",{"$f":"Survey!F9","v":"05621J05571"},null,null,"UNIT #","NAME",null,"ADDRESS",null,null,"CITY",null,null,"STATE","COUNTY","IECC ZONE","SERIAL #",{"$f":"Survey!$F$9","v":"05621J05571"},null,null,"UNIT #","NAME",null,"ADDRESS",null,null,"CITY",null,null,"STATE","COUNTY","IECC ZONE","SERIAL #",{"$f":"Survey!$F$11","v":"5622H07235"},null,null,"UNIT #","NAME",null,"ADDRESS",null,null,"CITY",null,null,"STATE","COUNTY","IECC ZONE","SERIAL #",{"$f":"Survey!F12","v":"5609A "},null,null,"UNIT #","NAME",null,"ADDRESS",null,null,"CITY",null,null,"STATE","COUNTY","IECC ZONE","SERIAL #",{"$f":"Survey!F13","v":0},null,null,"UNIT #","NAME",null,"ADDRESS",null,null,"CITY",null,null,"STATE","COUNTY","IECC ZONE","SERIAL #",{"$f":"Survey!F14","v":0},null,null,"UNIT #","NAME",null,"ADDRESS",null,null,"CITY",null,null,"STATE","COUNTY","IECC ZONE","SERIAL #",{"$f":"Survey!F15","v":0},null,null,"UNIT #","NAME",null,"ADDRESS",null,null,"CITY",null,null,"STATE","COUNTY","IECC ZONE","SERIAL #",{"$f":"Survey!$E$16","v":0}]
[null,{"$f":"Survey!B3","v":2233},{"$f":"Survey!F3","v":"Bristow FSU"},null,{"$f":"Survey!T3","v":"9939 Sowder Village Sq"},null,null,{"$f":"Survey!$AG$3","v":"Manassas"},null,null,{"$f":"'Store Data'!M10","v":"VA"},{"$f":"'Store Data'!N10","v":"Manassas"},{"$f":"VLOOKUP(L5&K5,'IECC '!B3:I3237,6,0)","v":4},"MODEL #",{"$f":"Survey!M9","v":"LGH180H4BH4Y"},null,null,{"$f":"$B$5","v":2233},{"$f":"$C$5","v":"Bristow FSU"},null,{"$f":"$E$5","v":"9939 Sowder Village Sq"},null,null,{"$f":"$H$5","v":"Manassas"},null,null,{"$f":"$K$5","v":"VA"},{"$f":"$L$5","v":"Manassas"},{"$f":"$M$5","v":4},"MODEL #",{"$f":"Survey!$M$10","v":"LGA102H2BH4Y"},null,null,{"$f":"$B$5","v":2233},{"$f":"$C$5","v":"Bristow FSU"},null,{"$f":"$E$5","v":"9939 Sowder Village Sq"},null,null,{"$f":"X5","v":"Manassas"},null,null,{"$f":"$K$5","v":"VA"},{"$f":"$L$5","v":"Manassas"},{"$f":"$M$5","v":4},"MODEL #",{"$f":"Survey!$M$11","v":"LGH150H4BH2Y"},null,null,{"$f":"$B$5","v":2233},{"$f":"$C$5","v":"Bristow FSU"},null,{"$f":"$E$5","v":"9939 Sowder Village Sq"},null,null,{"$f":"H5","v":"Manassas"},null,null,{"$f":"$K$5","v":"VA"},{"$f":"$L$5","v":"Manassas"},{"$f":"$M$5","v":4},"MODEL #",{"$f":"Survey!M12","v":"LGH060"},null,null,{"$f":"$B$5","v":2233},{"$f":"$C$5","v":"Bristow FSU"},null,{"$f":"$E$5","v":"9939 Sowder Village Sq"},null,null,{"$f":"H5","v":"Manassas"},null,null,{"$f":"$K$5","v":"VA"},{"$f":"$L$5","v":"Manassas"},{"$f":"$M$5","v":4},"MODEL #",{"$f":"Survey!M13","v":0},null,null,{"$f":"$B$5","v":2233},{"$f":"$C$5","v":"Bristow FSU"},null,{"$f":"$E$5","v":"9939 Sowder Village Sq"},null,null,{"$f":"H5","v":"Manassas"},null,null,{"$f":"$K$5","v":"VA"},{"$f":"$L$5","v":"Manassas"},{"$f":"$M$5","v":4},"MODEL #",{"$f":"Survey!M14","v":0},null,null,{"$f":"$B$5","v":2233},{"$f":"$C$5","v":"Bristow FSU"},null,{"$f":"$E$5","v":"9939 Sowder Village Sq"},null,null,{"$f":"H5","v":"Manassas"},null,null,{"$f":"$K$5","v":"VA"},{"$f":"$L$5","v":"Manassas"},{"$f":"$M$5","v":4},"MODEL #",{"$f":"Survey!M15","v":0},null,null,{"$f":"$B$5","v":2233},{"$f":"$C$5","v":"Bristow FSU"},null,{"$f":"$E$5","v":"9939 Sowder Village Sq"},null,null,{"$f":"H5","v":"Manassas"},null,null,{"$f":"$K$5","v":"VA"},{"$f":"$L$5","v":"Manassas"},{"$f":"$M$5","v":4},"MODEL #",{"$f":"Survey!$M$15","v":0}]
[null,"AGE",{"$f":"Survey!$AF$9","v":4.3123287671232875},"TONS",{"$f":"Survey!X9","v":"15"},"AREA SERVED",{"$f":"Survey!$AS$9","v":"KITCHEN"},"Percentage Life Span ",null,{"$f":"(C6/M6)*100","v":35.93607305936073},"Expected Life",null,{"$f":"IF(M5=1,'MASTER SCOPES'!$D$115,IF(M5=2,'MASTER SCOPES'!$D$116,IF(M5=3,'MASTER SCOPES'!$D$117,IF(M5=4,'MASTER SCOPES'!$D$118,IF(M5=5,'MASTER SCOPES'!$D$119,IF(M5=6,'MASTER SCOPES'!$D$120,IF(M5=7,'MASTER SCOPES'!D121)))))))","v":12},"MFG",{"$f":"Survey!$AA$9","v":"Lennox"},null,null,"AGE",{"$f":"Survey!$AF$10","v":16.986301369863014},"TONS",{"$f":"Survey!$X$10","v":"8.5"},"AREA SERVED",{"$f":"Survey!$AS$10","v":"MECH/RR/DIN A"},"Percentage Life Span ",null,{"$f":"($S$6/$AC$6)*100","v":141.55251141552512},"Expected Life",null,{"$f":"IF(AC5=1,'MASTER SCOPES'!$D$115,IF(AC5=2,'MASTER SCOPES'!$D$116,IF(AC5=3,'MASTER SCOPES'!$D$117,IF(AC5=4,'MASTER SCOPES'!$D$118,IF(AC5=5,'MASTER SCOPES'!$D$119,IF(AC5=6,'MASTER SCOPES'!$D$120,IF(AC5=7,'MASTER SCOPES'!T121)))))))","v":12},"MFG",{"$f":"Survey!AA10","v":"Lennox"},null,null,"AGE",{"$f":"Survey!$AF$11","v":3.3972602739726026},"TONS",{"$f":"Survey!$X$11","v":"12.5"},"AREA SERVED",{"$f":"Survey!AS11","v":"SERV/DT/ENTB,/DIN B"},"Percentage Life Span",null,{"$f":"($AI$6/$AS$6)*100","v":28.31050228310502},"Expected Life",null,{"$f":"IF(AS5=1,'MASTER SCOPES'!$D$115,IF(AS5=2,'MASTER SCOPES'!$D$116,IF(AS5=3,'MASTER SCOPES'!$D$117,IF(AS5=4,'MASTER SCOPES'!$D$118,IF(AS5=5,'MASTER SCOPES'!$D$119,IF(AS5=6,'MASTER SCOPES'!$D$120,IF(AS5=7,'MASTER SCOPES'!AJ121)))))))","v":12},"MFG",{"$f":"Survey!$AA$11","v":"Lennox"},null,null,"AGE",{"$f":"Survey!$AF$12","v":126.06575342465753},"TONS","AREA SERVED",null,{"$f":"Survey!AS12","v":"PLAYLAND"},"Percentage Life Span ",null,{"$f":"($AY$6/$BI$6)*100","v":1050.5479452054794},"Expected Life",null,{"$f":"IF(BI5=1,'MASTER SCOPES'!$D$115,IF(BI5=2,'MASTER SCOPES'!$D$116,IF(BI5=3,'MASTER SCOPES'!$D$117,IF(BI5=4,'MASTER SCOPES'!$D$118,IF(BI5=5,'MASTER SCOPES'!$D$119,IF(BI5=6,'MASTER SCOPES'!$D$120,IF(BI5=7,'MASTER SCOPES'!AZ121)))))))","v":12},"MFG",{"$f":"Survey!AA12","v":"Lennox"},null,null,"AGE",{"$f":"Survey!$AF$13","v":0},"TONS","AREA SERVED",null,{"$f":"Survey!AS13","v":0},"Percentage Life Span ",null,{"$f":"(BO6/BY6)*100","v":0},"Expected Life",null,{"$f":"IF(BY5=1,'MASTER SCOPES'!$D$115,IF(BY5=2,'MASTER SCOPES'!$D$116,IF(BY5=3,'MASTER SCOPES'!$D$117,IF(BY5=4,'MASTER SCOPES'!$D$118,IF(BY5=5,'MASTER SCOPES'!$D$119,IF(BY5=6,'MASTER SCOPES'!$D$120,IF(BY5=7,'MASTER SCOPES'!BP121)))))))","v":12},"MFG",{"$f":"Survey!AA13","v":""},null,null,"AGE",{"$f":"Survey!$AF$14","v":0},"TONS","AREA SERVED",null,{"$f":"Survey!AS14","v":""},"Percentage Life Span ",null,{"$f":"(CE6/CO6)*100","v":0},"Expected Life",null,{"$f":"IF(CO5=1,'MASTER SCOPES'!$D$115,IF(CO5=2,'MASTER SCOPES'!$D$116,IF(CO5=3,'MASTER SCOPES'!$D$117,IF(CO5=4,'MASTER SCOPES'!$D$118,IF(CO5=5,'MASTER SCOPES'!$D$119,IF(CO5=6,'MASTER SCOPES'!$D$120,IF(CO5=7,'MASTER SCOPES'!CF121)))))))","v":12},"MFG",{"$f":"Survey!AA14","v":""},null,null,"AGE",{"$f":"Survey!$AF$15","v":0},"TONS",{"$f":"Survey!$X$15","v":""},"AREA SERVED",{"$f":"Survey!AS15","v":0},"Percentage Life Span ",null,{"$f":"(CU6/DE6)*100","v":0},"Expected Life",null,{"$f":"IF(DE5=1,'MASTER SCOPES'!$D$115,IF(DE5=2,'MASTER SCOPES'!$D$116,IF(DE5=3,'MASTER SCOPES'!$D$117,IF(DE5=4,'MASTER SCOPES'!$D$118,IF(DE5=5,'MASTER SCOPES'!$D$119,IF(DE5=6,'MASTER SCOPES'!$D$120,IF(DE5=7,'MASTER SCOPES'!CV121)))))))","v":12},"MFG",{"$f":"Survey!AA15","v":""},null,null,"AGE",{"$f":"Survey!$AF$16","v":0},"TONS",{"$f":"Survey!$X$15","v":""},"AREA SERVED",{"$f":"Survey!AS16","v":0},"Percentage Life Span ",null,{"$f":"(DK6/DU6)*100","v":0},"Expected Life",null,{"$f":"IF(DU5=1,'MASTER SCOPES'!$D$115,IF(DU5=2,'MASTER SCOPES'!$D$116,IF(DU5=3,'MASTER SCOPES'!$D$117,IF(DU5=4,'MASTER SCOPES'!$D$118,IF(DU5=5,'MASTER SCOPES'!$D$119,IF(DU5=6,'MASTER SCOPES'!$D$120,IF(DU5=7,'MASTER SCOPES'!DL121)))))))","v":12},"MFG",{"$f":"Survey!$AA$16","v":""}]
[null,"Replacement guideline:  If RTU is greater than 75% of expected life, Repl. unit.  If RTU is less than 75% of expected life, Repl. part in question.",null,null,null,null,null,null,null,null,null,null,null,"TYPE",{"$f":"Survey!$AI$9","v":"ENERGENCE"},null,null,"Replacement guideline:  If RTU is greater than 75% of expected life, Repl. unit.  If RTU is less than 75% of expected life, Repl. part in question.",null,null,null,null,null,null,null,null,null,null,null,"TYPE",{"$f":"Survey!AI10","v":"L SERIES"},null,null,"Replacement guideline:  If RTU is greater than 75% of expected life, Repl. unit.  If RTU is less than 75% of expected life, Repl. part in question.",null,null,null,null,null,null,null,null,null,null,null,"TYPE",{"$f":"Survey!$AI$11","v":"ENERGENCE"},null,null,"Replacement guideline:  If RTU is greater than 75% of expected life, Repl. unit.  If RTU is less than 75% of expected life, Repl. part in question.",null,null,null,null,null,null,null,null,null,null,null,"TYPE",{"$f":"Survey!AI12","v":"L SERIES"},null,null,"Replacement guideline:  If RTU is greater than 75% of expected life, Repl. unit.  If RTU is less than 75% of expected life, Repl. part in question.",null,null,null,null,null,null,null,null,null,null,null,"TYPE",{"$f":"Survey!AI13","v":""},null,null,"Replacement guideline:  If RTU is greater than 75% of expected life, Repl. unit.  If RTU is less than 75% of expected life, Repl. part in question.",null,null,null,null,null,null,null,null,null,null,null,"TYPE",{"$f":"Survey!AI14","v":""},null,null,"Replacement guideline:  If RTU is greater than 75% of expected life, Repl. unit.  If RTU is less than 75% of expected life, Repl. part in question.",null,null,null,null,null,null,null,null,null,null,null,"TYPE",{"$f":"Survey!AI15","v":""},null,null,"Replacement guideline:  If RTU is greater than 75% of expected life, Repl. unit.  If RTU is less than 75% of expected life, Repl. part in question.",null,null,null,null,null,null,null,null,null,null,null,"TYPE",{"$f":"Survey!$AI$15","v":""}]
[null,"CONDITION SURVEY ITEMS",null,null,null,null,"SURVEY ANSWER","RECOMMENDED SOW FOR DEFICIENCY FIX",null,null,null,null,null,"OBLIGATION TO FIX","FINANCIAL RESPONSIBILITY",null,null,"CONDITION SURVEY ITEMS",null,null,null,null,"SURVEY ANSWER","RECOMMENDED SOW FOR DEFICIENCY FIX",null,null,null,null,null,"OBLIGATION TO FIX","FINANCIAL RESPONSIBILITY",null,null,"CONDITION SURVEY ITEMS",null,null,null,null,"SURVEY ANSWER","RECOMMENDED SOW FOR DEFICIENCY FIX",null,null,null,null,null,"OBLIGATION TO FIX","FINANCIAL RESPONSIBILITY",null,null,"CONDITION SURVEY ITEMS",null,null,null,null,"SURVEY ANSWER","RECOMMENDED SOW FOR DEFICIENCY FIX",null,null,null,null,null,"OBLIGATION TO FIX","FINANCIAL RESPONSIBILITY",null,null,"CONDITION SURVEY ITEMS",null,null,null,null,"SURVEY ANSWER","RECOMMENDED SOW FOR DEFICIENCY FIX",null,null,null,null,null,"OBLIGATION TO FIX","FINANCIAL RESPONSIBILITY",null,null,"CONDITION SURVEY ITEMS",null,null,null,null,"SURVEY ANSWER","RECOMMENDED SOW FOR DEFICIENCY FIX",null,null,null,null,null,"OBLIGATION TO FIX","FINANCIAL RESPONSIBILITY",null,null,"CONDITION SURVEY ITEMS",null,null,null,null,"SURVEY ANSWER","RECOMMENDED SOW FOR DEFICIENCY FIX",null,null,null,null,null,"OBLIGATION TO FIX","FINANCIAL RESPONSIBILITY",null,null,"CONDITION SURVEY ITEMS",null,null,null,null,"SURVEY ANSWER","RECOMMENDED SOW FOR DEFICIENCY FIX",null,null,null,null,null,"OBLIGATION TO FIX","FINANCIAL RESPONSIBILITY"]
[{"$f":"IF(G9=\"YES\",\"1\",\"\")","v":""},{"$f":"Survey!B17","v":"1.  Using punch/screwdriver, prod heat exchanger tubes.  If holes found and/or prod test fails enter YES, lockout unit and infom management. If not, enter NO."},null,null,null,null,{"$f":"'RTU1'!K7","v":0},{"$f":"IF(Survey!$F$18=\"N/A\",'MASTER SCOPES'!$E$7,IF(Survey!$F$18=\"NO\",'MASTER SCOPES'!$E$6,IF(AND(Survey!$F$18=\"YES\",$J$6>75),'MASTER SCOPES'!$J7,IF(AND(Survey!$F$18=\"YES\",$J6<=75),'MASTER SCOPES'!$E$9,\"\"))))","v":""},null,null,null,null,null,null,null,null,null,{"$f":"Survey!B17","v":"1.  Using punch/screwdriver, prod heat exchanger tubes.  If holes found and/or prod test fails enter YES, lockout unit and infom management. If not, enter NO."},null,null,null,null,{"$f":"'RTU2'!K7","v":0},{"$f":"IF(Survey!$N$18=\"N/A\",'MASTER SCOPES'!$E$7,IF(Survey!$N$18=\"NO\",'MASTER SCOPES'!$E$6,IF(AND(Survey!$N$18=\"YES\",$Z6>75),'MASTER SCOPES'!$E$8,IF(AND(Survey!$N$18=\"YES\",$Z6<=75),'MASTER SCOPES'!$E$9,\"\"))))","v":""},null,null,null,null,null,null,null,null,null,{"$f":"Survey!B17","v":"1.  Using punch/screwdriver, prod heat exchanger tubes.  If holes found and/or prod test fails enter YES, lockout unit and infom management. If not, enter NO."},null,null,null,null,{"$f":"'RTU3'!K7","v":0},{"$f":"IF(Survey!$V$18=\"N/A\",'MASTER SCOPES'!$E$7,IF(Survey!$V$18=\"NO\",'MASTER SCOPES'!$E$6,IF(AND(Survey!$V$18=\"YES\",$AP6>75),'MASTER SCOPES'!$E$8,IF(AND(Survey!$V$18=\"YES\",$AP6<=75),'MASTER SCOPES'!$E$9,\"\"))))","v":""},null,null,null,null,null,null,null,null,null,{"$f":"Survey!B17","v":"1.  Using punch/screwdriver, prod heat exchanger tubes.  If holes found and/or prod test fails enter YES, lockout unit and infom management. If not, enter NO."},null,null,null,null,{"$f":"'RTU4'!K7","v":0},{"$f":"IF(Survey!$AD$18=\"N/A\",'MASTER SCOPES'!$E$7,IF(Survey!$AD$18=\"NO\",'MASTER SCOPES'!$E$6,IF(AND(Survey!$AD$18=\"YES\",$BF6>75),'MASTER SCOPES'!$AR$8,IF(AND(Survey!$AD$18=\"YES\",$BF$6<=75),'MASTER SCOPES'!$E$9,\"\"))))","v":""},null,null,null,null,null,null,null,null,null,{"$f":"Survey!$B$17","v":"1.  Using punch/screwdriver, prod heat exchanger tubes.  If holes found and/or prod test fails enter YES, lockout unit and infom management. If not, enter NO."},null,null,null,null,{"$f":"'RTU5'!$K$7","v":0},{"$f":"IF(Survey!$AL$18=\"N/A\",'MASTER SCOPES'!$E$7,IF(Survey!$AL$18=\"NO\",'MASTER SCOPES'!$E$6,IF(AND(Survey!$AL$18=\"YES\",$BV6>75),'MASTER SCOPES'!$E$8,IF(AND(Survey!$AL$18=\"YES\",$BV6<=75),'MASTER SCOPES'!$E$9,\"\"))))","v":""},null,null,null,null,null,null,null,null,null,{"$f":"Survey!$B$17","v":"1.  Using punch/screwdriver, prod heat exchanger tubes.  If holes found and/or prod test fails enter YES, lockout unit and infom management. If not, enter NO."},null,null,null,null,{"$f":"'RTU6'!K7","v":0},{"$f":"IF(Survey!$AT$18=\"N/A\",'MASTER SCOPES'!$E$7,IF(Survey!$AT$18=\"NO\",'MASTER SCOPES'!$E$6,IF(AND(Survey!$AT$18=\"YES\",$CL6>75),'MASTER SCOPES'!$BR$8,IF(AND(Survey!$AT$18=\"YES\",$CL$6<=75),'MASTER SCOPES'!$E$9,\"\"))))","v":""},null,null,null,null,null,null,null,null,null,{"$f":"Survey!$B$17","v":"1.  Using punch/screwdriver, prod heat exchanger tubes.  If holes found and/or prod test fails enter YES, lockout unit and infom management. If not, enter NO."},null,null,null,null,{"$f":"'RTU7'!K7","v":0},{"$f":"IF(Survey!$BB$18=\"N/A\",'MASTER SCOPES'!$E$7,IF(Survey!$BB$18=\"NO\",'MASTER SCOPES'!$E$6,IF(AND(Survey!$BB$18=\"YES\",$DB6>75),'MASTER SCOPES'!$CE$8,IF(AND(Survey!$BB$18=\"YES\",$DB6<=75),'MASTER SCOPES'!$E$9,\"\"))))","v":""},null,null,null,null,null,null,null,null,null,{"$f":"Survey!$B$17","v":"1.  Using punch/screwdriver, prod heat exchanger tubes.  If holes found and/or prod test fails enter YES, lockout unit and infom management. If not, enter NO."},null,null,null,null,{"$f":"'RTU8'!K25","v":0},{"$f":"IF(Survey!$BJ$18=\"N/A\",'MASTER SCOPES'!$E$7,IF(Survey!$BJ$18=\"NO\",'MASTER SCOPES'!$E$6,IF(AND(Survey!$BJ$18=\"YES\",$DR$6>75),'MASTER SCOPES'!$CR$8,IF(AND(Survey!$BJ$18=\"YES\",$DR6<=75),'MASTER SCOPES'!$E$9,\"\"))))","v":""}]
[{"$f":"IF(AND(G9=\"YES\",G10>40),\"2\",\"1\")","v":"1"},{"$f":"Survey!B19","v":"2.  Quantify damage/deterioration to the condenser coil, and enter value 0% to 100%."},null,null,null,null,{"$f":"'RTU1'!K8","v":"N/A"},{"$f":"IF(Survey!$F$20=0,\"\",IF(Survey!$F$20=\"N/A\",'MASTER SCOPES'!$E$13,IF(Survey!$F$20<50,'MASTER SCOPES'!$E$12,IF(Survey!$F$20>=50,'MASTER SCOPES'!$E$11,\"\"))))","v":0},null,null,null,null,null,null,null,null,null,{"$f":"Survey!B19","v":"2.  Quantify damage/deterioration to the condenser coil, and enter value 0% to 100%."},null,null,null,null,{"$f":"'RTU2'!K8","v":0},{"$f":"IF(Survey!$N$20=0,\"\",IF(Survey!$N$20=\"N/A\",'MASTER SCOPES'!$E$13,IF(Survey!$N$20<50,'MASTER SCOPES'!$E$12,IF(Survey!$N$20>=50,'MASTER SCOPES'!$E$11,\"\"))))","v":""},null,null,null,null,null,null,null,null,null,{"$f":"Survey!B19","v":"2.  Quantify damage/deterioration to the condenser coil, and enter value 0% to 100%."},null,null,null,null,{"$f":"'RTU3'!K8","v":0},{"$f":"IF(Survey!$V$20=0,\"\",IF(Survey!$V$20=\"N/A\",'MASTER SCOPES'!$E$13,IF(Survey!$V$20<50,'MASTER SCOPES'!$E$12,IF(Survey!$V$20>=50,'MASTER SCOPES'!$E$11,\"\"))))","v":""},null,null,null,null,null,null,null,null,null,{"$f":"Survey!B19","v":"2.  Quantify damage/deterioration to the condenser coil, and enter value 0% to 100%."},null,null,null,null,{"$f":"'RTU4'!K8","v":0},{"$f":"IF(Survey!$AD$20=0,\"\",IF(Survey!$AD$20=\"N/A\",'MASTER SCOPES'!$E$13,IF(Survey!$AD$20<50,'MASTER SCOPES'!$E$12,IF(Survey!$AD$20>=50,'MASTER SCOPES'!$E$11,\"\"))))","v":""},null,null,null,null,null,null,null,null,null,{"$f":"Survey!B19","v":"2.  Quantify damage/deterioration to the condenser coil, and enter value 0% to 100%."},null,null,null,null,{"$f":"'RTU5'!K8","v":0},{"$f":"IF(Survey!$AL$20=0,\"\",IF(Survey!$AL$20=\"N/A\",'MASTER SCOPES'!$E$13,IF(Survey!$AL$20<50,'MASTER SCOPES'!$E$12,IF(Survey!$AL$20>=50,'MASTER SCOPES'!$E$11,\"\"))))","v":""},null,null,null,null,null,null,null,null,null,{"$f":"Survey!B19","v":"2.  Quantify damage/deterioration to the condenser coil, and enter value 0% to 100%."},null,null,null,null,{"$f":"'RTU6'!K8","v":0},{"$f":"IF(Survey!$AT$20=0,\"\",IF(Survey!$AT$20=\"N/A\",'MASTER SCOPES'!$E$13,IF(Survey!$AT$20<50,'MASTER SCOPES'!$E$12,IF(Survey!$AT$20>=50,'MASTER SCOPES'!$E$11,\"\"))))","v":""},null,null,null,null,null,null,null,null,null,{"$f":"Survey!B19","v":"2.  Quantify damage/deterioration to the condenser coil, and enter value 0% to 100%."},null,null,null,null,{"$f":"'RTU7'!K8","v":0},{"$f":"IF(Survey!$BB$20=0,\"\",IF(Survey!$BB$20=\"N/A\",'MASTER SCOPES'!$E$13,IF(Survey!$BB$20<50,'MASTER SCOPES'!$E$12,IF(Survey!$BB$20>=50,'MASTER SCOPES'!$E$11,\"\"))))","v":""},null,null,null,null,null,null,null,null,null,{"$f":"Survey!B19","v":"2.  Quantify damage/deterioration to the condenser coil, and enter value 0% to 100%."},null,null,null,null,{"$f":"'RTU8'!K8","v":0},{"$f":"IF(Survey!$BJ$20=0,\"\",IF(Survey!$BJ$20=\"N/A\",'MASTER SCOPES'!$E$13,IF(Survey!$BJ$20<50,'MASTER SCOPES'!$E$12,IF(Survey!$BJ$20>=50,'MASTER SCOPES'!$E$11,\"\"))))","v":""}]
[null,{"$f":"Survey!B21","v":"3.  Is there a hail guard installed on unit?  Enter YES or NO.  NOTE: If \"CRITICAL\", unit in top ten hail states."},null,null,null,null,{"$f":"'RTU1'!K9","v":"N/A"},{"$f":"IF(Survey!$F$22=0,\"\",IF(Survey!$F$22=\"N/A\",'MASTER SCOPES'!$E$17,IF(Survey!$F$22=\"N/A\",'MASTER SCOPES'!$E$18,IF(Survey!$F$22=\"YES\",'MASTER SCOPES'!$E$18,IF(AND(OR($K$5=\"NC\",$K$5=\"IA\",$K$5=\"MN\",$K$5=\"TX\",$K$5=\"AR\",$K$5=\"MO\",$K$5=\"KS\",$K$5=\"NEB\",$K$5=\"SD\"),Survey!$F$22=\"NO\"),'MASTER SCOPES'!$E$15,'MASTER SCOPES'!$E$16)))))","v":0},null,null,null,null,null,null,null,null,null,{"$f":"Survey!B21","v":"3.  Is there a hail guard installed on unit?  Enter YES or NO.  NOTE: If \"CRITICAL\", unit in top ten hail states."},null,null,null,null,{"$f":"'RTU2'!K9","v":0},{"$f":"IF(Survey!$N$22=0,\"\",IF(Survey!$N$22=\"N/A\",'MASTER SCOPES'!$E$17,IF(Survey!$N$22=\"N/A\",'MASTER SCOPES'!$E$18,IF(Survey!$N$22=\"YES\",'MASTER SCOPES'!$E$18,IF(AND(OR($K$5=\"NC\",$K$5=\"IA\",$K$5=\"MN\",$K$5=\"TX\",$K$5=\"AR\",$K$5=\"MO\",$K$5=\"KS\",$K$5=\"NEB\",$K$5=\"SD\"),Survey!$N$22=\"NO\"),'MASTER SCOPES'!$E$15,'MASTER SCOPES'!$E$16)))))","v":""},null,null,null,null,null,null,null,null,null,{"$f":"Survey!B21","v":"3.  Is there a hail guard installed on unit?  Enter YES or NO.  NOTE: If \"CRITICAL\", unit in top ten hail states."},null,null,null,null,{"$f":"'RTU3'!K9","v":0},{"$f":"IF(Survey!$V$22=0,\"\",IF(Survey!$V$22=\"N/A\",'MASTER SCOPES'!$E$17,IF(Survey!$V$22=\"N/A\",'MASTER SCOPES'!$E$18,IF(Survey!$V$22=\"YES\",'MASTER SCOPES'!$E$18,IF(AND(OR($K$5=\"NC\",$K$5=\"IA\",$K$5=\"MN\",$K$5=\"TX\",$K$5=\"AR\",$K$5=\"MO\",$K$5=\"KS\",$K$5=\"NEB\",$K$5=\"SD\"),Survey!$V$22=\"NO\"),'MASTER SCOPES'!$E$15,'MASTER SCOPES'!$E$16)))))","v":""},null,null,null,null,null,null,null,null,null,{"$f":"Survey!B21","v":"3.  Is there a hail guard installed on unit?  Enter YES or NO.  NOTE: If \"CRITICAL\", unit in top ten hail states."},null,null,null,null,{"$f":"'RTU4'!K9","v":0},{"$f":"IF(Survey!$AD$22=0,\"\",IF(Survey!$AD$22=\"N/A\",'MASTER SCOPES'!$E$17,IF(Survey!$AD$22=\"N/A\",'MASTER SCOPES'!$E$18,IF(Survey!$AD$22=\"YES\",'MASTER SCOPES'!$E$18,IF(AND(OR($K$5=\"NC\",$K$5=\"IA\",$K$5=\"MN\",$K$5=\"TX\",$K$5=\"AR\",$K$5=\"MO\",$K$5=\"KS\",$K$5=\"NEB\",$K$5=\"SD\"),Survey!$AD$22=\"NO\"),'MASTER SCOPES'!$E$15,'MASTER SCOPES'!$E$16)))))","v":""},null,null,null,null,null,null,null,null,null,{"$f":"Survey!B21","v":"3.  Is there a hail guard installed on unit?  Enter YES or NO.  NOTE: If \"CRITICAL\", unit in top ten hail states."},null,null,null,null,{"$f":"'RTU5'!K9","v":0},{"$f":"IF(Survey!$AL$22=0,\"\",IF(Survey!$AL$22=\"N/A\",'MASTER SCOPES'!$E$17,IF(Survey!$AL$22=\"N/A\",'MASTER SCOPES'!$E$18,IF(Survey!$AL$22=\"YES\",'MASTER SCOPES'!$E$18,IF(AND(OR($K$5=\"NC\",$K$5=\"IA\",$K$5=\"MN\",$K$5=\"TX\",$K$5=\"AR\",$K$5=\"MO\",$K$5=\"KS\",$K$5=\"NEB\",$K$5=\"SD\"),Survey!$AL$22=\"NO\"),'MASTER SCOPES'!$E$15,'MASTER SCOPES'!$E$16)))))","v":""},null,null,null,null,null,null,null,null,null,{"$f":"Survey!B21","v":"3.  Is there a hail guard installed on unit?  Enter YES or NO.  NOTE: If \"CRITICAL\", unit in top ten hail states."},null,null,null,null,{"$f":"'RTU6'!K9","v":0},{"$f":"IF(Survey!$AT$22=0,\"\",IF(Survey!$AT$22=\"N/A\",'MASTER SCOPES'!$E$17,IF(Survey!$AT$22=\"N/A\",'MASTER SCOPES'!$E$18,IF(Survey!$AT$22=\"YES\",'MASTER SCOPES'!$E$18,IF(AND(OR($K$5=\"NC\",$K$5=\"IA\",$K$5=\"MN\",$K$5=\"TX\",$K$5=\"AR\",$K$5=\"MO\",$K$5=\"KS\",$K$5=\"NEB\",$K$5=\"SD\"),Survey!$AT$22=\"NO\"),'MASTER SCOPES'!$E$15,'MASTER SCOPES'!$E$16)))))","v":""},null,null,null,null,null,null,null,null,null,{"$f":"Survey!B21","v":"3.  Is there a hail guard installed on unit?  Enter YES or NO.  NOTE: If \"CRITICAL\", unit in top ten hail states."},null,null,null,null,{"$f":"'RTU7'!K9","v":0},{"$f":"IF(Survey!$BB$22=0,\"\",IF(Survey!$BB$22=\"N/A\",'MASTER SCOPES'!$E$17,IF(Survey!$BB$22=\"N/A\",'MASTER SCOPES'!$E$18,IF(Survey!$BB$22=\"YES\",'MASTER SCOPES'!$E$18,IF(AND(OR($K$5=\"NC\",$K$5=\"IA\",$K$5=\"MN\",$K$5=\"TX\",$K$5=\"AR\",$K$5=\"MO\",$K$5=\"KS\",$K$5=\"NEB\",$K$5=\"SD\"),Survey!$BB$22=\"NO\"),'MASTER SCOPES'!$E$15,'MASTER SCOPES'!$E$16)))))","v":""},null,null,null,null,null,null,null,null,null,{"$f":"Survey!B21","v":"3.  Is there a hail guard installed on unit?  Enter YES or NO.  NOTE: If \"CRITICAL\", unit in top ten hail states."},null,null,null,null,{"$f":"'RTU8'!K9","v":0},{"$f":"IF(Survey!$BJ$22=0,\"\",IF(Survey!$BJ$22=\"N/A\",'MASTER SCOPES'!$E$17,IF(Survey!$BJ$22=\"N/A\",'MASTER SCOPES'!$E$18,IF(Survey!$BJ$22=\"YES\",'MASTER SCOPES'!$E$18,IF(AND(OR($K$5=\"NC\",$K$5=\"IA\",$K$5=\"MN\",$K$5=\"TX\",$K$5=\"AR\",$K$5=\"MO\",$K$5=\"KS\",$K$5=\"NEB\",$K$5=\"SD\"),Survey!$BJ$22=\"NO\"),'MASTER SCOPES'!$E$15,'MASTER SCOPES'!$E$16)))))","v":""}]
[null,{"$f":"Survey!B23","v":"4.  Quantify damage/deterioration evaporator coil, and enter value 0% to 100%."},null,null,null,null,{"$f":"'RTU1'!K10","v":"N/A"},{"$f":"IF(Survey!$F$24=0,\"\",IF(Survey!$F$24=\"N/A\",'MASTER SCOPES'!E$22,IF(Survey!$F$24<50,'MASTER SCOPES'!$E$12,IF(Survey!$F$24>=50,'MASTER SCOPES'!$E$11,\"\"))))","v":0},null,null,null,null,null,null,null,null,null,{"$f":"Survey!B23","v":"4.  Quantify damage/deterioration evaporator coil, and enter value 0% to 100%."},null,null,null,null,{"$f":"'RTU2'!K10","v":0},{"$f":"IF(Survey!$N$24=0,\"\",IF(Survey!$N$24=\"N/A\",'MASTER SCOPES'!R$22,IF(Survey!$N$24<50,'MASTER SCOPES'!$E$12,IF(Survey!$N$24>=50,'MASTER SCOPES'!$E$11,\"\"))))","v":""},null,null,null,null,null,null,null,null,null,{"$f":"Survey!B23","v":"4.  Quantify damage/deterioration evaporator coil, and enter value 0% to 100%."},null,null,null,null,{"$f":"'RTU3'!K10","v":0},{"$f":"IF(Survey!$V$24=0,\"\",IF(Survey!$V$24=\"N/A\",'MASTER SCOPES'!AE$22,IF(Survey!$V$24<50,'MASTER SCOPES'!$E$12,IF(Survey!$V$24>=50,'MASTER SCOPES'!$E$11,\"\"))))","v":""},null,null,null,null,null,null,null,null,null,{"$f":"Survey!B23","v":"4.  Quantify damage/deterioration evaporator coil, and enter value 0% to 100%."},null,null,null,null,{"$f":"'RTU4'!K10","v":0},{"$f":"IF(Survey!$AD$24=0,\"\",IF(Survey!$AD$24=\"N/A\",'MASTER SCOPES'!AR$22,IF(Survey!$AD$24<50,'MASTER SCOPES'!$E$12,IF(Survey!$AD$24>=50,'MASTER SCOPES'!$E$11,\"\"))))","v":""},null,null,null,null,null,null,null,null,null,{"$f":"Survey!B23","v":"4.  Quantify damage/deterioration evaporator coil, and enter value 0% to 100%."},null,null,null,null,{"$f":"'RTU5'!K10","v":0},{"$f":"IF(Survey!$AL$24=0,\"\",IF(Survey!$AL$24=\"N/A\",'MASTER SCOPES'!BE$22,IF(Survey!$AL$24<50,'MASTER SCOPES'!$E$12,IF(Survey!$AL$24>=50,'MASTER SCOPES'!$E$11,\"\"))))","v":""},null,null,null,null,null,null,null,null,null,{"$f":"Survey!B23","v":"4.  Quantify damage/deterioration evaporator coil, and enter value 0% to 100%."},null,null,null,null,{"$f":"'RTU6'!K10","v":0},{"$f":"IF(Survey!$AT$24=0,\"\",IF(Survey!$AT$24=\"N/A\",'MASTER SCOPES'!BR$22,IF(Survey!$AT$24<50,'MASTER SCOPES'!$E$12,IF(Survey!$AT$24>=50,'MASTER SCOPES'!$E$11,\"\"))))","v":""},null,null,null,null,null,null,null,null,null,{"$f":"Survey!B23","v":"4.  Quantify damage/deterioration evaporator coil, and enter value 0% to 100%."},null,null,null,null,{"$f":"'RTU7'!K10","v":0},{"$f":"IF(Survey!$BB$24=0,\"\",IF(Survey!$BB$24=\"N/A\",'MASTER SCOPES'!CE$22,IF(Survey!$BB$24<50,'MASTER SCOPES'!$E$12,IF(Survey!$BB$24>=50,'MASTER SCOPES'!$E$11,\"\"))))","v":""},null,null,null,null,null,null,null,null,null,{"$f":"Survey!B23","v":"4.  Quantify damage/deterioration evaporator coil, and enter value 0% to 100%."},null,null,null,null,{"$f":"'RTU8'!K10","v":0},{"$f":"IF(Survey!$BJ$24=0,\"\",IF(Survey!$BJ$24=\"N/A\",'MASTER SCOPES'!CR$22,IF(Survey!$BJ$24<50,'MASTER SCOPES'!$E$12,IF(Survey!$BJ$24>=50,'MASTER SCOPES'!$E$11,\"\"))))","v":""}]
[null,{"$f":"Survey!B25","v":"5.  Check for power exhaust at AC units greater than ten tons.  If no power exhaust, enter NO.  If there is a power exhaust enter YES"},null,null,null,null,{"$f":"'RTU1'!K11","v":"N/A"},{"$f":"IF(Survey!$F$26=\"N/A\",'MASTER SCOPES'!$E$25,IF(Survey!$F$26=0,\"\",IF(Survey!$F$26=\"YES\",'MASTER SCOPES'!$E$24,IF(Survey!$F$26=\"NO\",'MASTER SCOPES'!$E$26,\"\"))))","v":0},null,null,null,null,null,null,null,null,null,{"$f":"Survey!B25","v":"5.  Check for power exhaust at AC units greater than ten tons.  If no power exhaust, enter NO.  If there is a power exhaust enter YES"},null,null,null,null,{"$f":"'RTU2'!K11","v":"N/A"},{"$f":"IF(Survey!$N$26=\"N/A\",'MASTER SCOPES'!$E$25,IF(Survey!$N$26=0,\"\",IF(Survey!$N$26=\"YES\",'MASTER SCOPES'!$E$24,IF(Survey!$N$26=\"NO\",'MASTER SCOPES'!$E$26,\"\"))))","v":0},null,null,null,null,null,null,null,null,null,{"$f":"Survey!B25","v":"5.  Check for power exhaust at AC units greater than ten tons.  If no power exhaust, enter NO.  If there is a power exhaust enter YES"},null,null,null,null,{"$f":"'RTU3'!K11","v":0},{"$f":"IF(Survey!$V$26=\"N/A\",'MASTER SCOPES'!$E$25,IF(Survey!$V$26=0,\"\",IF(Survey!$V$26=\"YES\",'MASTER SCOPES'!$E$24,IF(Survey!$V$26=\"NO\",'MASTER SCOPES'!$E$26,\"\"))))","v":""},null,null,null,null,null,null,null,null,null,{"$f":"Survey!B25","v":"5.  Check for power exhaust at AC units greater than ten tons.  If no power exhaust, enter NO.  If there is a power exhaust enter YES"},null,null,null,null,{"$f":"'RTU4'!K11","v":"N/A"},{"$f":"IF(Survey!$AD$26=\"N/A\",'MASTER SCOPES'!$E$25,IF(Survey!$AD$26=0,\"\",IF(Survey!$AD$26=\"YES\",'MASTER SCOPES'!$E$24,IF(Survey!$AD$26=\"NO\",'MASTER SCOPES'!$E$26,\"\"))))","v":0},null,null,null,null,null,null,null,null,null,{"$f":"Survey!B25","v":"5.  Check for power exhaust at AC units greater than ten tons.  If no power exhaust, enter NO.  If there is a power exhaust enter YES"},null,null,null,null,{"$f":"'RTU5'!K11","v":0},{"$f":"IF(Survey!$AL$26=\"N/A\",'MASTER SCOPES'!$E$25,IF(Survey!$AL$26=0,\"\",IF(Survey!$AL$26=\"YES\",'MASTER SCOPES'!$E$24,IF(Survey!$AL$26=\"NO\",'MASTER SCOPES'!$E$26,\"\"))))","v":""},null,null,null,null,null,null,null,null,null,{"$f":"Survey!B25","v":"5.  Check for power exhaust at AC units greater than ten tons.  If no power exhaust, enter NO.  If there is a power exhaust enter YES"},null,null,null,null,{"$f":"'RTU6'!K11","v":0},{"$f":"IF(Survey!$AT$26=\"N/A\",'MASTER SCOPES'!$E$25,IF(Survey!$AT$26=0,\"\",IF(Survey!$AT$26=\"YES\",'MASTER SCOPES'!$E$24,IF(Survey!$AT$26=\"NO\",'MASTER SCOPES'!$E$26,\"\"))))","v":""},null,null,null,null,null,null,null,null,null,{"$f":"Survey!B25","v":"5.  Check for power exhaust at AC units greater than ten tons.  If no power exhaust, enter NO.  If there is a power exhaust enter YES"},null,null,null,null,{"$f":"'RTU7'!K11","v":0},{"$f":"IF(Survey!$BB$26=\"N/A\",'MASTER SCOPES'!$E$25,IF(Survey!$BB$26=0,\"\",IF(Survey!$BB$26=\"YES\",'MASTER SCOPES'!$E$24,IF(Survey!$BB$26=\"NO\",'MASTER SCOPES'!$E$26,\"\"))))","v":""},null,null,null,null,null,null,null,null,null,{"$f":"Survey!B25","v":"5.  Check for power exhaust at AC units greater than ten tons.  If no power exhaust, enter NO.  If there is a power exhaust enter YES"},null,null,null,null,{"$f":"'RTU8'!K11","v":0},{"$f":"IF(Survey!$BJ$26=\"N/A\",'MASTER SCOPES'!$E$25,IF(Survey!$BJ$26=0,\"\",IF(Survey!$BJ$26=\"YES\",'MASTER SCOPES'!$E$24,IF(Survey!$BJ$26=\"NO\",'MASTER SCOPES'!$E$26,\"\"))))","v":""}]
[null,{"$f":"Survey!B27","v":"6.  Are there curb adaptors on any of the units?  Enter YES or NO."},null,null,null,null,{"$f":"'RTU1'!K12","v":"N/A"},{"$f":"IF(Survey!$F$28=\"N/A\",'MASTER SCOPES'!$E$29,IF(Survey!$F$28=\"NO\",'MASTER SCOPES'!$E$30,IF(Survey!$F$28=\"YES\",'MASTER SCOPES'!$E$28,\"\")))","v":0},null,null,null,null,null,null,null,null,null,{"$f":"Survey!B27","v":"6.  Are there curb adaptors on any of the units?  Enter YES or NO."},null,null,null,null,{"$f":"'RTU2'!K12","v":0},{"$f":"IF(Survey!$N$28=\"N/A\",'MASTER SCOPES'!$E$29,IF(Survey!$N$28=\"NO\",'MASTER SCOPES'!$E$30,IF(Survey!$N$28=\"YES\",'MASTER SCOPES'!$E$28,\"\")))","v":""},null,null,null,null,null,null,null,null,null,{"$f":"Survey!B27","v":"6.  Are there curb adaptors on any of the units?  Enter YES or NO."},null,null,null,null,{"$f":"'RTU3'!K12","v":0},{"$f":"IF(Survey!$V$28=\"N/A\",'MASTER SCOPES'!$E$29,IF(Survey!$V$28=\"NO\",'MASTER SCOPES'!$E$30,IF(Survey!$V$28=\"YES\",'MASTER SCOPES'!$E$28,\"\")))","v":""},null,null,null,null,null,null,null,null,null,{"$f":"Survey!B27","v":"6.  Are there curb adaptors on any of the units?  Enter YES or NO."},null,null,null,null,{"$f":"'RTU4'!K12","v":0},{"$f":"IF(Survey!$AD$28=\"N/A\",'MASTER SCOPES'!$E$29,IF(Survey!$AD$28=\"NO\",'MASTER SCOPES'!$E$30,IF(Survey!$AD$28=\"YES\",'MASTER SCOPES'!$E$28,\"\")))","v":""},null,null,null,null,null,null,null,null,null,{"$f":"Survey!B27","v":"6.  Are there curb adaptors on any of the units?  Enter YES or NO."},null,null,null,null,{"$f":"'RTU5'!K12","v":0},{"$f":"IF(Survey!$AL$28=\"N/A\",'MASTER SCOPES'!$E$29,IF(Survey!$AL$28=\"NO\",'MASTER SCOPES'!$E$30,IF(Survey!$AL$28=\"YES\",'MASTER SCOPES'!$E$28,\"\")))","v":""},null,null,null,null,null,null,null,null,null,{"$f":"Survey!B27","v":"6.  Are there curb adaptors on any of the units?  Enter YES or NO."},null,null,null,null,{"$f":"'RTU6'!K12","v":0},{"$f":"IF(Survey!$AT$28=\"N/A\",'MASTER SCOPES'!$E$29,IF(Survey!$AT$28=\"NO\",'MASTER SCOPES'!$E$30,IF(Survey!$AT$28=\"YES\",'MASTER SCOPES'!$E$28,\"\")))","v":""},null,null,null,null,null,null,null,null,null,{"$f":"Survey!B27","v":"6.  Are there curb adaptors on any of the units?  Enter YES or NO."},null,null,null,null,{"$f":"'RTU7'!K12","v":0},{"$f":"IF(Survey!$BB$28=\"N/A\",'MASTER SCOPES'!$E$29,IF(Survey!$BB$28=\"NO\",'MASTER SCOPES'!$E$30,IF(Survey!$BB$28=\"YES\",'MASTER SCOPES'!$E$28,\"\")))","v":""},null,null,null,null,null,null,null,null,null,{"$f":"Survey!B27","v":"6.  Are there curb adaptors on any of the units?  Enter YES or NO."},null,null,null,null,{"$f":"'RTU8'!K12","v":0},{"$f":"IF(Survey!$BJ$28=\"N/A\",'MASTER SCOPES'!$E$29,IF(Survey!$BJ$28=\"NO\",'MASTER SCOPES'!$E$30,IF(Survey!$BJ$28=\"YES\",'MASTER SCOPES'!$E$28,\"\")))","v":""}]
[null,{"$f":"Survey!B29","v":"7.  If the unit is a dehumidification type unit,  does it have the humidistat device? If so enter YES or NO."},null,null,null,null,{"$f":"'RTU1'!K14","v":"N/A"},{"$f":"IF(Survey!$F$30=\"N/A\",'MASTER SCOPES'!$E$33,IF(Survey!$F$30=\"YES\",'MASTER SCOPES'!$E$32,IF(Survey!$F$30=\"NO\",'MASTER SCOPES'!$E$34,\"\")))","v":0},null,null,null,null,null,null,null,null,null,{"$f":"Survey!B29","v":"7.  If the unit is a dehumidification type unit,  does it have the humidistat device? If so enter YES or NO."},null,null,null,null,{"$f":"'RTU2'!K14","v":0},{"$f":"IF(Survey!$N$30=\"N/A\",'MASTER SCOPES'!$E$33,IF(Survey!$N$30=\"YES\",'MASTER SCOPES'!$E$32,IF(Survey!$N$30=\"NO\",'MASTER SCOPES'!$E$34,\"\")))","v":""},null,null,null,null,null,null,null,null,null,{"$f":"Survey!B29","v":"7.  If the unit is a dehumidification type unit,  does it have the humidistat device? If so enter YES or NO."},null,null,null,null,{"$f":"'RTU3'!K14","v":0},{"$f":"IF(Survey!$V$30=\"N/A\",'MASTER SCOPES'!$E$33,IF(Survey!$V$30=\"YES\",'MASTER SCOPES'!$E$32,IF(Survey!$V$30=\"NO\",'MASTER SCOPES'!$E$34,\"\")))","v":""},null,null,null,null,null,null,null,null,null,{"$f":"Survey!B29","v":"7.  If the unit is a dehumidification type unit,  does it have the humidistat device? If so enter YES or NO."},null,null,null,null,{"$f":"'RTU4'!K14","v":0},{"$f":"IF(Survey!$AD$30=\"N/A\",'MASTER SCOPES'!$E$33,IF(Survey!$AD$30=\"YES\",'MASTER SCOPES'!$E$32,IF(Survey!$AD$30=\"NO\",'MASTER SCOPES'!$E$34,\"\")))","v":""},null,null,null,null,null,null,null,null,null,{"$f":"Survey!B29","v":"7.  If the unit is a dehumidification type unit,  does it have the humidistat device? If so enter YES or NO."},null,null,null,null,{"$f":"'RTU5'!K14","v":""},{"$f":"IF(Survey!$AL$30=\"N/A\",'MASTER SCOPES'!$E$33,IF(Survey!$AL$30=\"YES\",'MASTER SCOPES'!$E$32,IF(Survey!$AL$30=\"NO\",'MASTER SCOPES'!$E$34,\"\")))","v":""},null,null,null,null,null,null,null,null,null,{"$f":"Survey!B29","v":"7.  If the unit is a dehumidification type unit,  does it have the humidistat device? If so enter YES or NO."},null,null,null,null,{"$f":"'RTU6'!K14","v":""},{"$f":"IF(Survey!$AT$30=\"N/A\",'MASTER SCOPES'!$E$33,IF(Survey!$AT$30=\"YES\",'MASTER SCOPES'!$E$32,IF(Survey!$AT$30=\"NO\",'MASTER SCOPES'!$E$34,\"\")))","v":""},null,null,null,null,null,null,null,null,null,{"$f":"Survey!B29","v":"7.  If the unit is a dehumidification type unit,  does it have the humidistat device? If so enter YES or NO."},null,null,null,null,{"$f":"'RTU7'!K13","v":0},{"$f":"IF(Survey!$BB$30=\"N/A\",'MASTER SCOPES'!$E$33,IF(Survey!$BB$30=\"YES\",'MASTER SCOPES'!$E$32,IF(Survey!$BB$30=\"NO\",'MASTER SCOPES'!$E$34,\"\")))","v":""},null,null,null,null,null,null,null,null,null,{"$f":"Survey!B29","v":"7.  If the unit is a dehumidification type unit,  does it have the humidistat device? If so enter YES or NO."},null,null,null,null,{"$f":"'RTU8'!K13","v":0},{"$f":"IF(Survey!$BJ$30=\"N/A\",'MASTER SCOPES'!$E$33,IF(Survey!$BJ$30=\"YES\",'MASTER SCOPES'!$E$32,IF(Survey!$BJ$30=\"NO\",'MASTER SCOPES'!$E$34,\"\")))","v":""}]
[null,{"$f":"Survey!B31","v":"8.  If the unit is a dehumidification type unit,  is the wiring correct from the device to the RTU Master Control Board?  If so enter YES or NO.  Lennox = Two separate shielded ComCables; Trane = One shielded two conductor ComCable."},null,null,null,null,{"$f":"'RTU1'!K15","v":0},{"$f":"IF(Survey!$F$32=0,\"\",IF(Survey!$F$32=\"N/A\",'MASTER SCOPES'!$E$37,IF(Survey!$F$32=\"YES\",'MASTER SCOPES'!$E$36,IF(AND(Survey!$F$32=\"NO\",$O6=\"Lennox\"),'MASTER SCOPES'!$E$38,IF(AND(Survey!$F$32=\"NO\",$O6=\"Trane\"),'MASTER SCOPES'!$E$39,\"\")))))","v":""},null,null,null,null,null,null,null,null,null,{"$f":"Survey!B31","v":"8.  If the unit is a dehumidification type unit,  is the wiring correct from the device to the RTU Master Control Board?  If so enter YES or NO.  Lennox = Two separate shielded ComCables; Trane = One shielded two conductor ComCable."},null,null,null,null,{"$f":"'RTU2'!K15","v":0},{"$f":"IF(Survey!$N$32=0,\"\",IF(Survey!$N$32=\"N/A\",'MASTER SCOPES'!$E$37,IF(Survey!$N$32=\"YES\",'MASTER SCOPES'!$E$36,IF(AND(Survey!$N$32=\"NO\",$AE6=\"Lennox\"),'MASTER SCOPES'!$E$38,IF(AND(Survey!$N$32=\"NO\",$AE6=\"Trane\"),'MASTER SCOPES'!$E$39,\"\")))))","v":""},null,null,null,null,null,null,null,null,null,{"$f":"Survey!B31","v":"8.  If the unit is a dehumidification type unit,  is the wiring correct from the device to the RTU Master Control Board?  If so enter YES or NO.  Lennox = Two separate shielded ComCables; Trane = One shielded two conductor ComCable."},null,null,null,null,{"$f":"'RTU3'!K15","v":0},{"$f":"IF(Survey!$V$32=0,\"\",IF(Survey!$V$32=\"N/A\",'MASTER SCOPES'!$E$37,IF(Survey!$V$32=\"YES\",'MASTER SCOPES'!$E$36,IF(AND(Survey!$V$32=\"NO\",$AU6=\"Lennox\"),'MASTER SCOPES'!$E$38,IF(AND(Survey!$V$32=\"NO\",$AU6=\"Trane\"),'MASTER SCOPES'!$E$39,\"\")))))","v":""},null,null,null,null,null,null,null,null,null,{"$f":"Survey!B31","v":"8.  If the unit is a dehumidification type unit,  is the wiring correct from the device to the RTU Master Control Board?  If so enter YES or NO.  Lennox = Two separate shielded ComCables; Trane = One shielded two conductor ComCable."},null,null,null,null,{"$f":"'RTU4'!K15","v":0},{"$f":"IF(Survey!$AD$32=0,\"\",IF(Survey!$AD$32=\"N/A\",'MASTER SCOPES'!$E$37,IF(Survey!$AD$32=\"YES\",'MASTER SCOPES'!$E$36,IF(AND(Survey!$AD$32=\"NO\",$BK6=\"Lennox\"),'MASTER SCOPES'!$E$38,IF(AND(Survey!$AD$32=\"NO\",$BK6=\"Trane\"),'MASTER SCOPES'!$E$39,\"\")))))","v":""},null,null,null,null,null,null,null,null,null,{"$f":"Survey!B31","v":"8.  If the unit is a dehumidification type unit,  is the wiring correct from the device to the RTU Master Control Board?  If so enter YES or NO.  Lennox = Two separate shielded ComCables; Trane = One shielded two conductor ComCable."},null,null,null,null,{"$f":"'RTU5'!K15","v":""},{"$f":"IF(Survey!$AL$32=0,\"\",IF(Survey!$AL$32=\"N/A\",'MASTER SCOPES'!$E$37,IF(Survey!$AL$32=\"YES\",'MASTER SCOPES'!$E$36,IF(AND(Survey!$AL$32=\"NO\",$CA6=\"Lennox\"),'MASTER SCOPES'!$E$38,IF(AND(Survey!$AL$32=\"NO\",$CA6=\"Trane\"),'MASTER SCOPES'!$E$39,\"\")))))","v":""},null,null,null,null,null,null,null,null,null,{"$f":"Survey!B31","v":"8.  If the unit is a dehumidification type unit,  is the wiring correct from the device to the RTU Master Control Board?  If so enter YES or NO.  Lennox = Two separate shielded ComCables; Trane = One shielded two conductor ComCable."},null,null,null,null,{"$f":"'RTU6'!K15","v":""},{"$f":"IF(Survey!$AT$32=0,\"\",IF(Survey!$AT$32=\"N/A\",'MASTER SCOPES'!$E$37,IF(Survey!$AT$32=\"YES\",'MASTER SCOPES'!$E$36,IF(AND(Survey!$AT$32=\"NO\",$CQ6=\"Lennox\"),'MASTER SCOPES'!$E$38,IF(AND(Survey!$AT$32=\"NO\",$CQ6=\"Trane\"),'MASTER SCOPES'!$E$39,\"\")))))","v":""},null,null,null,null,null,null,null,null,null,{"$f":"Survey!B31","v":"8.  If the unit is a dehumidification type unit,  is the wiring correct from the device to the RTU Master Control Board?  If so enter YES or NO.  Lennox = Two separate shielded ComCables; Trane = One shielded two conductor ComCable."},null,null,null,null,{"$f":"'RTU7'!K14","v":0},{"$f":"IF(Survey!$BB$32=0,\"\",IF(Survey!$BB$32=\"N/A\",'MASTER SCOPES'!$E$37,IF(Survey!$BB$32=\"YES\",'MASTER SCOPES'!$E$36,IF(AND(Survey!$BB$32=\"NO\",$DG6=\"Lennox\"),'MASTER SCOPES'!$E$38,IF(AND(Survey!$BB$32=\"NO\",$DG6=\"Trane\"),'MASTER SCOPES'!$E$39,\"\")))))","v":""},null,null,null,null,null,null,null,null,null,{"$f":"Survey!B31","v":"8.  If the unit is a dehumidification type unit,  is the wiring correct from the device to the RTU Master Control Board?  If so enter YES or NO.  Lennox = Two separate shielded ComCables; Trane = One shielded two conductor ComCable."},null,null,null,null,{"$f":"'RTU8'!K14","v":0},{"$f":"IF(Survey!$BJ$32=0,\"\",IF(Survey!$BJ$32=\"N/A\",'MASTER SCOPES'!$E$37,IF(Survey!$BJ$32=\"YES\",'MASTER SCOPES'!$E$36,IF(AND(Survey!$BJ$32=\"NO\",$DV6=\"Lennox\"),'MASTER SCOPES'!$E$38,IF(AND(Survey!$BJ$32=\"NO\",$DV6=\"Trane\"),'MASTER SCOPES'!$E$39,\"\")))))","v":""}]
[null,{"$f":"Survey!B33","v":"9.  Is a smoke detector present in unit?  If no smoked detector, enter NO.  If there is a smoke detector, enter YES."},null,null,null,null,{"$f":"'RTU1'!K16","v":0},{"$f":"IF(Survey!$F$34=0,\"\",IF(Survey!$F$34=\"N/A\",'MASTER SCOPES'!$E$42,IF(Survey!$F$34=\"NO\",'MASTER SCOPES'!$E$43,'MASTER SCOPES'!$E$41)))","v":""},null,null,null,null,null,null,null,null,null,{"$f":"Survey!B33","v":"9.  Is a smoke detector present in unit?  If no smoked detector, enter NO.  If there is a smoke detector, enter YES."},null,null,null,null,{"$f":"'RTU2'!K16","v":0},{"$f":"IF(Survey!$N$34=0,\"\",IF(Survey!$N$34=\"N/A\",'MASTER SCOPES'!$E$42,IF(Survey!$N$34=\"NO\",'MASTER SCOPES'!$E$43,'MASTER SCOPES'!$E$41)))","v":""},null,null,null,null,null,null,null,null,null,{"$f":"Survey!B33","v":"9.  Is a smoke detector present in unit?  If no smoked detector, enter NO.  If there is a smoke detector, enter YES."},null,null,null,null,{"$f":"'RTU3'!K16","v":0},{"$f":"IF(Survey!$V$34=0,\"\",IF(Survey!$V$34=\"N/A\",'MASTER SCOPES'!$E$42,IF(Survey!$V$34=\"NO\",'MASTER SCOPES'!$E$43,'MASTER SCOPES'!$E$41)))","v":""},null,null,null,null,null,null,null,null,null,{"$f":"Survey!B33","v":"9.  Is a smoke detector present in unit?  If no smoked detector, enter NO.  If there is a smoke detector, enter YES."},null,null,null,null,{"$f":"'RTU4'!K16","v":0},{"$f":"IF(Survey!$AD$34=0,\"\",IF(Survey!$AD$34=\"N/A\",'MASTER SCOPES'!$E$42,IF(Survey!$AD$34=\"NO\",'MASTER SCOPES'!$E$43,'MASTER SCOPES'!$E$41)))","v":""},null,null,null,null,null,null,null,null,null,{"$f":"Survey!B33","v":"9.  Is a smoke detector present in unit?  If no smoked detector, enter NO.  If there is a smoke detector, enter YES."},null,null,null,null,{"$f":"'RTU5'!K16","v":0},{"$f":"IF(Survey!$AL$34=0,\"\",IF(Survey!$AL$34=\"N/A\",'MASTER SCOPES'!$E$42,IF(Survey!$AL$34=\"NO\",'MASTER SCOPES'!$E$43,'MASTER SCOPES'!$E$41)))","v":""},null,null,null,null,null,null,null,null,null,{"$f":"Survey!B33","v":"9.  Is a smoke detector present in unit?  If no smoked detector, enter NO.  If there is a smoke detector, enter YES."},null,null,null,null,{"$f":"'RTU6'!K16","v":0},{"$f":"IF(Survey!$AT$34=0,\"\",IF(Survey!$AT$34=\"N/A\",'MASTER SCOPES'!$E$42,IF(Survey!$AT$34=\"NO\",'MASTER SCOPES'!$E$43,'MASTER SCOPES'!$E$41)))","v":""},null,null,null,null,null,null,null,null,null,{"$f":"Survey!B33","v":"9.  Is a smoke detector present in unit?  If no smoked detector, enter NO.  If there is a smoke detector, enter YES."},null,null,null,null,{"$f":"'RTU7'!K15","v":0},{"$f":"IF(Survey!$BB$34=0,\"\",IF(Survey!$BB$34=\"N/A\",'MASTER SCOPES'!$E$42,IF(Survey!$BB$34=\"NO\",'MASTER SCOPES'!$E$43,'MASTER SCOPES'!$E$41)))","v":""},null,null,null,null,null,null,null,null,null,{"$f":"Survey!B33","v":"9.  Is a smoke detector present in unit?  If no smoked detector, enter NO.  If there is a smoke detector, enter YES."},null,null,null,null,{"$f":"'RTU8'!K15","v":0},{"$f":"IF(Survey!$BJ$34=0,\"\",IF(Survey!$BJ$34=\"N/A\",'MASTER SCOPES'!$E$42,IF(Survey!$BJ$34=\"NO\",'MASTER SCOPES'!$E$43,'MASTER SCOPES'!$E$41)))","v":""}]
[null,{"$f":"Survey!B35","v":"10.  Is the smoke detector inlet sampling tube capped?  If not capped, enter NO.  If capped enter YES."},null,null,null,null,{"$f":"'RTU1'!K17","v":""},{"$f":"IF(Survey!$F$36=\"N/A\",'MASTER SCOPES'!$E$46,IF(Survey!$F$36=\"NO\",'MASTER SCOPES'!$E$47,IF(Survey!$F$36=\"YES\",'MASTER SCOPES'!$E$45,\"\")))","v":""},null,null,null,null,null,null,null,null,null,{"$f":"Survey!B35","v":"10.  Is the smoke detector inlet sampling tube capped?  If not capped, enter NO.  If capped enter YES."},null,null,null,null,{"$f":"'RTU2'!K17","v":""},{"$f":"IF(Survey!$N$36=\"N/A\",'MASTER SCOPES'!$E$46,IF(Survey!$N$36=\"NO\",'MASTER SCOPES'!$E$47,IF(Survey!$N$36=\"YES\",'MASTER SCOPES'!$E$45,\"\")))","v":""},null,null,null,null,null,null,null,null,null,{"$f":"Survey!B35","v":"10.  Is the smoke detector inlet sampling tube capped?  If not capped, enter NO.  If capped enter YES."},null,null,null,null,{"$f":"'RTU3'!K17","v":""},{"$f":"IF(Survey!$V$36=\"N/A\",'MASTER SCOPES'!$E$46,IF(Survey!$V$36=\"NO\",'MASTER SCOPES'!$E$47,IF(Survey!$V$36=\"YES\",'MASTER SCOPES'!$E$45,\"\")))","v":""},null,null,null,null,null,null,null,null,null,{"$f":"Survey!B35","v":"10.  Is the smoke detector inlet sampling tube capped?  If not capped, enter NO.  If capped enter YES."},null,null,null,null,{"$f":"'RTU4'!K17","v":""},{"$f":"IF(Survey!$AD$36=\"N/A\",'MASTER SCOPES'!$E$46,IF(Survey!$AD$36=\"NO\",'MASTER SCOPES'!$E$47,IF(Survey!$AD$36=\"YES\",'MASTER SCOPES'!$E$45,\"\")))","v":""},null,null,null,null,null,null,null,null,null,{"$f":"Survey!B35","v":"10.  Is the smoke detector inlet sampling tube capped?  If not capped, enter NO.  If capped enter YES."},null,null,null,null,{"$f":"'RTU5'!K17","v":""},{"$f":"IF(Survey!$AL$36=\"N/A\",'MASTER SCOPES'!$E$46,IF(Survey!$AL$36=\"NO\",'MASTER SCOPES'!$E$47,IF(Survey!$AL$36=\"YES\",'MASTER SCOPES'!$E$45,\"\")))","v":""},null,null,null,null,null,null,null,null,null,{"$f":"Survey!B35","v":"10.  Is the smoke detector inlet sampling tube capped?  If not capped, enter NO.  If capped enter YES."},null,null,null,null,{"$f":"'RTU6'!K17","v":""},{"$f":"IF(Survey!$AT$36=\"N/A\",'MASTER SCOPES'!$E$46,IF(Survey!$AT$36=\"NO\",'MASTER SCOPES'!$E$47,IF(Survey!$AT$36=\"YES\",'MASTER SCOPES'!$E$45,\"\")))","v":""},null,null,null,null,null,null,null,null,null,{"$f":"Survey!B35","v":"10.  Is the smoke detector inlet sampling tube capped?  If not capped, enter NO.  If capped enter YES."},null,null,null,null,{"$f":"'RTU7'!K16","v":""},{"$f":"IF(Survey!$BB$36=\"N/A\",'MASTER SCOPES'!$E$46,IF(Survey!$BB$36=\"NO\",'MASTER SCOPES'!$E$47,IF(Survey!$BB$36=\"YES\",'MASTER SCOPES'!$E$45,\"\")))","v":""},null,null,null,null,null,null,null,null,null,{"$f":"Survey!B35","v":"10.  Is the smoke detector inlet sampling tube capped?  If not capped, enter NO.  If capped enter YES."},null,null,null,null,{"$f":"'RTU8'!K16","v":"N/A"},{"$f":"IF(Survey!$BJ$36=\"N/A\",'MASTER SCOPES'!$E$46,IF(Survey!$BJ$36=\"NO\",'MASTER SCOPES'!$E$47,IF(Survey!$BJ$36=\"YES\",'MASTER SCOPES'!$E$45,\"\")))","v":0}]
[null,{"$f":"Survey!B37","v":"11.  Check smoke detector module light. If light RED or an AMBER color.  If either color, enter YES, and If not enter NO."},null,null,null,null,{"$f":"'RTU1'!K18","v":""},{"$f":"IF(Survey!$F$38=\"N/A\",'MASTER SCOPES'!$E$50,IF(Survey!$F$38=\"YES\",'MASTER SCOPES'!$E$49,IF(Survey!$F$38=\"NO\",'MASTER SCOPES'!$E$51,\"\")))","v":""},null,null,null,null,null,null,null,null,null,{"$f":"Survey!B37","v":"11.  Check smoke detector module light. If light RED or an AMBER color.  If either color, enter YES, and If not enter NO."},null,null,null,null,{"$f":"'RTU2'!K18","v":""},{"$f":"IF(Survey!$N$38=\"N/A\",'MASTER SCOPES'!$E$50,IF(Survey!$N$38=\"YES\",'MASTER SCOPES'!$E$49,IF(Survey!$N$38=\"NO\",'MASTER SCOPES'!$E$51,\"\")))","v":""},null,null,null,null,null,null,null,null,null,{"$f":"Survey!B37","v":"11.  Check smoke detector module light. If light RED or an AMBER color.  If either color, enter YES, and If not enter NO."},null,null,null,null,{"$f":"'RTU3'!K18","v":""},{"$f":"IF(Survey!$V$38=\"N/A\",'MASTER SCOPES'!$E$50,IF(Survey!$V$38=\"YES\",'MASTER SCOPES'!$E$49,IF(Survey!$V$38=\"NO\",'MASTER SCOPES'!$E$51,\"\")))","v":""},null,null,null,null,null,null,null,null,null,{"$f":"Survey!B37","v":"11.  Check smoke detector module light. If light RED or an AMBER color.  If either color, enter YES, and If not enter NO."},null,null,null,null,{"$f":"'RTU4'!K18","v":""},{"$f":"IF(Survey!$AD$38=\"N/A\",'MASTER SCOPES'!$E$50,IF(Survey!$AD$38=\"YES\",'MASTER SCOPES'!$E$49,IF(Survey!$AD$38=\"NO\",'MASTER SCOPES'!$E$51,\"\")))","v":""},null,null,null,null,null,null,null,null,null,{"$f":"Survey!B37","v":"11.  Check smoke detector module light. If light RED or an AMBER color.  If either color, enter YES, and If not enter NO."},null,null,null,null,{"$f":"'RTU5'!K18","v":""},{"$f":"IF(Survey!$AL$38=\"N/A\",'MASTER SCOPES'!$E$50,IF(Survey!$AL$38=\"YES\",'MASTER SCOPES'!$E$49,IF(Survey!$AL$38=\"NO\",'MASTER SCOPES'!$E$51,\"\")))","v":""},null,null,null,null,null,null,null,null,null,{"$f":"Survey!B37","v":"11.  Check smoke detector module light. If light RED or an AMBER color.  If either color, enter YES, and If not enter NO."},null,null,null,null,{"$f":"'RTU6'!K18","v":""},{"$f":"IF(Survey!$AT$38=\"N/A\",'MASTER SCOPES'!$E$50,IF(Survey!$AT$38=\"YES\",'MASTER SCOPES'!$E$49,IF(Survey!$AT$38=\"NO\",'MASTER SCOPES'!$E$51,\"\")))","v":""},null,null,null,null,null,null,null,null,null,{"$f":"Survey!B37","v":"11.  Check smoke detector module light. If light RED or an AMBER color.  If either color, enter YES, and If not enter NO."},null,null,null,null,{"$f":"'RTU7'!K17","v":""},{"$f":"IF(Survey!$BB$38=\"N/A\",'MASTER SCOPES'!$E$50,IF(Survey!$BB$38=\"YES\",'MASTER SCOPES'!$E$49,IF(Survey!$BB$38=\"NO\",'MASTER SCOPES'!$E$51,\"\")))","v":""},null,null,null,null,null,null,null,null,null,{"$f":"Survey!B37","v":"11.  Check smoke detector module light. If light RED or an AMBER color.  If either color, enter YES, and If not enter NO."},null,null,null,null,{"$f":"'RTU8'!K17","v":"N/A"},{"$f":"IF(Survey!$BJ$38=\"N/A\",'MASTER SCOPES'!$E$50,IF(Survey!$BJ$38=\"YES\",'MASTER SCOPES'!$E$49,IF(Survey!$BJ$38=\"NO\",'MASTER SCOPES'!$E$51,\"\")))","v":0}]
[null,{"$f":"Survey!B39","v":"12.  Is smoke detector dust plugs capped?  If capped, enter YES, and if not enter NO."},null,null,null,null,{"$f":"'RTU1'!K19","v":""},{"$f":"IF(Survey!$F$40=\"N/A\",'MASTER SCOPES'!$E$54,IF(Survey!$F$40=\"YES\",'MASTER SCOPES'!$E$53,IF(Survey!$F$40=\"NO\",'MASTER SCOPES'!$E$51,\"\")))","v":""},null,null,null,null,null,null,null,null,null,{"$f":"Survey!B39","v":"12.  Is smoke detector dust plugs capped?  If capped, enter YES, and if not enter NO."},null,null,null,null,{"$f":"'RTU2'!K19","v":""},{"$f":"IF(Survey!$N$40=\"N/A\",'MASTER SCOPES'!$E$54,IF(Survey!$N$40=\"YES\",'MASTER SCOPES'!$E$53,IF(Survey!$N$40=\"NO\",'MASTER SCOPES'!$E$51,\"\")))","v":""},null,null,null,null,null,null,null,null,null,{"$f":"Survey!B39","v":"12.  Is smoke detector dust plugs capped?  If capped, enter YES, and if not enter NO."},null,null,null,null,{"$f":"'RTU3'!K19","v":""},{"$f":"IF(Survey!$V$40=\"N/A\",'MASTER SCOPES'!$E$54,IF(Survey!$V$40=\"YES\",'MASTER SCOPES'!$E$53,IF(Survey!$V$40=\"NO\",'MASTER SCOPES'!$E$51,\"\")))","v":""},null,null,null,null,null,null,null,null,null,{"$f":"Survey!B39","v":"12.  Is smoke detector dust plugs capped?  If capped, enter YES, and if not enter NO."},null,null,null,null,{"$f":"'RTU4'!K19","v":""},{"$f":"IF(Survey!$AD$40=\"N/A\",'MASTER SCOPES'!$E$54,IF(Survey!$AD$40=\"YES\",'MASTER SCOPES'!$E$53,IF(Survey!$AD$40=\"NO\",'MASTER SCOPES'!$E$51,\"\")))","v":""},null,null,null,null,null,null,null,null,null,{"$f":"Survey!B39","v":"12.  Is smoke detector dust plugs capped?  If capped, enter YES, and if not enter NO."},null,null,null,null,{"$f":"'RTU5'!K19","v":""},{"$f":"IF(Survey!$AL$40=\"N/A\",'MASTER SCOPES'!$E$54,IF(Survey!$AL$40=\"YES\",'MASTER SCOPES'!$E$53,IF(Survey!$AL$40=\"NO\",'MASTER SCOPES'!$E$51,\"\")))","v":""},null,null,null,null,null,null,null,null,null,{"$f":"Survey!B39","v":"12.  Is smoke detector dust plugs capped?  If capped, enter YES, and if not enter NO."},null,null,null,null,{"$f":"'RTU6'!K19","v":""},{"$f":"IF(Survey!$AT$40=\"N/A\",'MASTER SCOPES'!$E$54,IF(Survey!$AT$40=\"YES\",'MASTER SCOPES'!$E$53,IF(Survey!$AT$40=\"NO\",'MASTER SCOPES'!$E$51,\"\")))","v":""},null,null,null,null,null,null,null,null,null,{"$f":"Survey!B39","v":"12.  Is smoke detector dust plugs capped?  If capped, enter YES, and if not enter NO."},null,null,null,null,{"$f":"'RTU7'!K18","v":""},{"$f":"IF(Survey!$BB$40=\"N/A\",'MASTER SCOPES'!$E$54,IF(Survey!$BB$40=\"YES\",'MASTER SCOPES'!$E$53,IF(Survey!$BB$40=\"NO\",'MASTER SCOPES'!$E$51,\"\")))","v":""},null,null,null,null,null,null,null,null,null,{"$f":"Survey!B39","v":"12.  Is smoke detector dust plugs capped?  If capped, enter YES, and if not enter NO."},null,null,null,null,{"$f":"'RTU8'!K18","v":"N/A"},{"$f":"IF(Survey!$BJ$40=\"N/A\",'MASTER SCOPES'!$E$54,IF(Survey!$BJ$40=\"YES\",'MASTER SCOPES'!$E$53,IF(Survey!$BJ$40=\"NO\",'MASTER SCOPES'!$E$51,\"\")))","v":0}]
[null,{"$f":"Survey!B41","v":"13.  Identify any damage to the blower.  If DAMAGE found, enter YES and if not enter NO.  Describe issue in Miscellaneous notes."},null,null,null,null,{"$f":"'RTU1'!K20","v":"N/A"},{"$f":"IF(Survey!$F$42=0,\"\",IF(Survey!$F$42=\"N/A\",'MASTER SCOPES'!$E$59,IF(Survey!$F$42=\"NO\",'MASTER SCOPES'!$E$60,IF(AND(Survey!$F$42=\"YES\",$J6>85),'MASTER SCOPES'!$E$57,'MASTER SCOPES'!$E$58))))","v":0},null,null,null,null,null,null,null,null,null,{"$f":"Survey!B41","v":"13.  Identify any damage to the blower.  If DAMAGE found, enter YES and if not enter NO.  Describe issue in Miscellaneous notes."},null,null,null,null,{"$f":"'RTU2'!K20","v":0},{"$f":"IF(Survey!$N$42=0,\"\",IF(Survey!$N$42=\"N/A\",'MASTER SCOPES'!$E$59,IF(Survey!$N$42=\"NO\",'MASTER SCOPES'!$E$60,IF(AND(Survey!$N$42=\"YES\",$Z6>85),'MASTER SCOPES'!$E$57,'MASTER SCOPES'!$E$58))))","v":""},null,null,null,null,null,null,null,null,null,{"$f":"Survey!B41","v":"13.  Identify any damage to the blower.  If DAMAGE found, enter YES and if not enter NO.  Describe issue in Miscellaneous notes."},null,null,null,null,{"$f":"'RTU3'!K20","v":0},{"$f":"IF(Survey!$V$42=0,\"\",IF(Survey!$V$42=\"N/A\",'MASTER SCOPES'!$E$59,IF(Survey!$V$42=\"NO\",'MASTER SCOPES'!$E$60,IF(AND(Survey!$V$42=\"YES\",$AP6>85),'MASTER SCOPES'!$E$57,'MASTER SCOPES'!$E$58))))","v":""},null,null,null,null,null,null,null,null,null,{"$f":"Survey!B41","v":"13.  Identify any damage to the blower.  If DAMAGE found, enter YES and if not enter NO.  Describe issue in Miscellaneous notes."},null,null,null,null,{"$f":"'RTU4'!K20","v":0},{"$f":"IF(Survey!$AD$42=0,\"\",IF(Survey!$AD$42=\"N/A\",'MASTER SCOPES'!$E$59,IF(Survey!$AD$42=\"NO\",'MASTER SCOPES'!$E$60,IF(AND(Survey!$AD$42=\"YES\",$BF6>85),'MASTER SCOPES'!$E$57,'MASTER SCOPES'!$E$58))))","v":""},null,null,null,null,null,null,null,null,null,{"$f":"Survey!B41","v":"13.  Identify any damage to the blower.  If DAMAGE found, enter YES and if not enter NO.  Describe issue in Miscellaneous notes."},null,null,null,null,{"$f":"'RTU5'!K20","v":0},{"$f":"IF(Survey!$AL$42=0,\"\",IF(Survey!$AL$42=\"N/A\",'MASTER SCOPES'!$E$59,IF(Survey!$AL$42=\"NO\",'MASTER SCOPES'!$E$60,IF(AND(Survey!$AL$42=\"YES\",$BV6>85),'MASTER SCOPES'!$E$57,'MASTER SCOPES'!$E$58))))","v":""},null,null,null,null,null,null,null,null,null,{"$f":"Survey!B41","v":"13.  Identify any damage to the blower.  If DAMAGE found, enter YES and if not enter NO.  Describe issue in Miscellaneous notes."},null,null,null,null,{"$f":"'RTU6'!K20","v":0},{"$f":"IF(Survey!$AT$42=0,\"\",IF(Survey!$AT$42=\"N/A\",'MASTER SCOPES'!$E$59,IF(Survey!$AT$42=\"NO\",'MASTER SCOPES'!$E$60,IF(AND(Survey!$AT$42=\"YES\",$CL6>85),'MASTER SCOPES'!$E$57,'MASTER SCOPES'!$E$58))))","v":""},null,null,null,null,null,null,null,null,null,{"$f":"Survey!B41","v":"13.  Identify any damage to the blower.  If DAMAGE found, enter YES and if not enter NO.  Describe issue in Miscellaneous notes."},null,null,null,null,{"$f":"'RTU7'!K19","v":0},{"$f":"IF(Survey!$BB$42=0,\"\",IF(Survey!$BB$42=\"N/A\",'MASTER SCOPES'!$E$59,IF(Survey!$BB$42=\"NO\",'MASTER SCOPES'!$E$60,IF(AND(Survey!$BB$42=\"YES\",DB6>85),'MASTER SCOPES'!$E$57,'MASTER SCOPES'!$E$58))))","v":""},null,null,null,null,null,null,null,null,null,{"$f":"Survey!B41","v":"13.  Identify any damage to the blower.  If DAMAGE found, enter YES and if not enter NO.  Describe issue in Miscellaneous notes."},null,null,null,null,{"$f":"'RTU8'!K19","v":0},{"$f":"IF(Survey!$BJ$42=0,\"\",IF(Survey!$BJ$42=\"N/A\",'MASTER SCOPES'!$E$59,IF(Survey!$BJ$42=\"NO\",'MASTER SCOPES'!$E$60,IF(AND(Survey!$BJ$42=\"YES\",$DR6>85),'MASTER SCOPES'!$E$57,'MASTER SCOPES'!$E$58))))","v":""}]
[null,{"$f":"Survey!B43","v":"14.  Is blank plate secured or missing on B-cabinets?  If secured, enter YES and if not enter NO. If blank plate is missing, enter M."},null,null,null,null,{"$f":"'RTU1'!K21","v":"N/A"},{"$f":"IF(Survey!$F$44=0,\"\",IF(Survey!$F$44=\"N/A\",'MASTER SCOPES'!$E$63,IF(Survey!$F$44=\"NO\",'MASTER SCOPES'!$E$64,IF(Survey!$F$44=\"M\",'MASTER SCOPES'!$E$65,'MASTER SCOPES'!$E$62))))","v":0},null,null,null,null,null,null,null,null,null,{"$f":"Survey!B43","v":"14.  Is blank plate secured or missing on B-cabinets?  If secured, enter YES and if not enter NO. If blank plate is missing, enter M."},null,null,null,null,{"$f":"'RTU2'!K21","v":"N/A"},{"$f":"IF(Survey!$N$44=0,\"\",IF(Survey!$N$44=\"N/A\",'MASTER SCOPES'!$E$63,IF(Survey!$N$44=\"NO\",'MASTER SCOPES'!$E$64,IF(Survey!$N$44=\"M\",'MASTER SCOPES'!$E$65,'MASTER SCOPES'!$E$62))))","v":0},null,null,null,null,null,null,null,null,null,{"$f":"Survey!B43","v":"14.  Is blank plate secured or missing on B-cabinets?  If secured, enter YES and if not enter NO. If blank plate is missing, enter M."},null,null,null,null,{"$f":"'RTU3'!K21","v":0},{"$f":"IF(Survey!$V$44=0,\"\",IF(Survey!$V$44=\"N/A\",'MASTER SCOPES'!$E$63,IF(Survey!$V$44=\"NO\",'MASTER SCOPES'!$E$64,IF(Survey!$V$44=\"M\",'MASTER SCOPES'!$E$65,'MASTER SCOPES'!$E$62))))","v":""},null,null,null,null,null,null,null,null,null,{"$f":"Survey!B43","v":"14.  Is blank plate secured or missing on B-cabinets?  If secured, enter YES and if not enter NO. If blank plate is missing, enter M."},null,null,null,null,{"$f":"'RTU4'!K21","v":"N/A"},{"$f":"IF(Survey!$AD$44=0,\"\",IF(Survey!$AD$44=\"N/A\",'MASTER SCOPES'!$E$63,IF(Survey!$AD$44=\"NO\",'MASTER SCOPES'!$E$64,IF(Survey!$AD$44=\"M\",'MASTER SCOPES'!$E$65,'MASTER SCOPES'!$E$62))))","v":0},null,null,null,null,null,null,null,null,null,{"$f":"Survey!B43","v":"14.  Is blank plate secured or missing on B-cabinets?  If secured, enter YES and if not enter NO. If blank plate is missing, enter M."},null,null,null,null,{"$f":"'RTU5'!K21","v":0},{"$f":"IF(Survey!$AL$44=0,\"\",IF(Survey!$AL$44=\"N/A\",'MASTER SCOPES'!$E$63,IF(Survey!$AL$44=\"NO\",'MASTER SCOPES'!$E$64,IF(Survey!$AL$44=\"M\",'MASTER SCOPES'!$E$65,'MASTER SCOPES'!$E$62))))","v":""},null,null,null,null,null,null,null,null,null,{"$f":"Survey!B43","v":"14.  Is blank plate secured or missing on B-cabinets?  If secured, enter YES and if not enter NO. If blank plate is missing, enter M."},null,null,null,null,{"$f":"'RTU6'!K21","v":0},{"$f":"IF(Survey!$AT$44=0,\"\",IF(Survey!$AT$44=\"N/A\",'MASTER SCOPES'!$E$63,IF(Survey!$AT$44=\"NO\",'MASTER SCOPES'!$E$64,IF(Survey!$AT$44=\"M\",'MASTER SCOPES'!$E$65,'MASTER SCOPES'!$E$62))))","v":""},null,null,null,null,null,null,null,null,null,{"$f":"Survey!B43","v":"14.  Is blank plate secured or missing on B-cabinets?  If secured, enter YES and if not enter NO. If blank plate is missing, enter M."},null,null,null,null,{"$f":"'RTU7'!K20","v":0},{"$f":"IF(Survey!$BB$44=0,\"\",IF(Survey!$BB$44=\"N/A\",'MASTER SCOPES'!$E$63,IF(Survey!$BB$44=\"NO\",'MASTER SCOPES'!$E$64,IF(Survey!$BB$44=\"M\",'MASTER SCOPES'!$E$65,'MASTER SCOPES'!$E$62))))","v":""},null,null,null,null,null,null,null,null,null,{"$f":"Survey!B43","v":"14.  Is blank plate secured or missing on B-cabinets?  If secured, enter YES and if not enter NO. If blank plate is missing, enter M."},null,null,null,null,{"$f":"'RTU8'!K20","v":0},{"$f":"IF(Survey!$BJ$44=0,\"\",IF(Survey!$BJ$44=\"N/A\",'MASTER SCOPES'!$E$63,IF(Survey!$BJ$44=\"NO\",'MASTER SCOPES'!$E$64,IF(Survey!$BJ$44=\"M\",'MASTER SCOPES'!$E$65,'MASTER SCOPES'!$E$62))))","v":""}]
[null,{"$f":"Survey!B45","v":"15.  Is ductwork lined?  If ductwork is lined, is it intact and undamaged?  If so, enter I.  If ductwork damaged and/or deteriorating, enter D.  If ductwork is not lined, enter NO."},null,null,null,null,{"$f":"'RTU1'!K22","v":"N/A"},{"$f":"IF(Survey!$F$46=0,\"\",IF(Survey!$F$46=\"N/A\",'MASTER SCOPES'!$E$68,IF(Survey!$F$46=\"I\",'MASTER SCOPES'!$E$67,IF(Survey!$F$46=\"D\",'MASTER SCOPES'!$E$69,'MASTER SCOPES'!$E$67))))","v":0},null,null,null,null,null,null,null,null,null,{"$f":"Survey!B45","v":"15.  Is ductwork lined?  If ductwork is lined, is it intact and undamaged?  If so, enter I.  If ductwork damaged and/or deteriorating, enter D.  If ductwork is not lined, enter NO."},null,null,null,null,{"$f":"'RTU2'!K22","v":0},{"$f":"IF(Survey!$N$46=0,\"\",IF(Survey!$N$46=\"N/A\",'MASTER SCOPES'!$E$68,IF(Survey!$N$46=\"I\",'MASTER SCOPES'!$E$67,IF(Survey!$N$46=\"D\",'MASTER SCOPES'!$E$69,'MASTER SCOPES'!$E$67))))","v":""},null,null,null,null,null,null,null,null,null,{"$f":"Survey!B45","v":"15.  Is ductwork lined?  If ductwork is lined, is it intact and undamaged?  If so, enter I.  If ductwork damaged and/or deteriorating, enter D.  If ductwork is not lined, enter NO."},null,null,null,null,{"$f":"'RTU3'!K22","v":0},{"$f":"IF(Survey!$V$46=0,\"\",IF(Survey!$V$46=\"N/A\",'MASTER SCOPES'!$E$68,IF(Survey!$V$46=\"I\",'MASTER SCOPES'!$E$67,IF(Survey!$V$46=\"D\",'MASTER SCOPES'!$E$69,'MASTER SCOPES'!$E$67))))","v":""},null,null,null,null,null,null,null,null,null,{"$f":"Survey!B45","v":"15.  Is ductwork lined?  If ductwork is lined, is it intact and undamaged?  If so, enter I.  If ductwork damaged and/or deteriorating, enter D.  If ductwork is not lined, enter NO."},null,null,null,null,{"$f":"'RTU4'!K22","v":0},{"$f":"IF(Survey!$AD$46=0,\"\",IF(Survey!$AD$46=\"N/A\",'MASTER SCOPES'!$E$68,IF(Survey!$AD$46=\"I\",'MASTER SCOPES'!$E$67,IF(Survey!$AD$46=\"D\",'MASTER SCOPES'!$E$69,'MASTER SCOPES'!$E$67))))","v":""},null,null,null,null,null,null,null,null,null,{"$f":"Survey!B45","v":"15.  Is ductwork lined?  If ductwork is lined, is it intact and undamaged?  If so, enter I.  If ductwork damaged and/or deteriorating, enter D.  If ductwork is not lined, enter NO."},null,null,null,null,{"$f":"'RTU5'!K22","v":0},{"$f":"IF(Survey!$AL$46=0,\"\",IF(Survey!$AL$46=\"N/A\",'MASTER SCOPES'!$E$68,IF(Survey!$AL$46=\"I\",'MASTER SCOPES'!$E$67,IF(Survey!$AL$46=\"D\",'MASTER SCOPES'!$E$69,'MASTER SCOPES'!$E$67))))","v":""},null,null,null,null,null,null,null,null,null,{"$f":"Survey!B45","v":"15.  Is ductwork lined?  If ductwork is lined, is it intact and undamaged?  If so, enter I.  If ductwork damaged and/or deteriorating, enter D.  If ductwork is not lined, enter NO."},null,null,null,null,{"$f":"'RTU6'!K22","v":0},{"$f":"IF(Survey!$AT$46=0,\"\",IF(Survey!$AT$46=\"N/A\",'MASTER SCOPES'!$E$68,IF(Survey!$AT$46=\"I\",'MASTER SCOPES'!$E$67,IF(Survey!$AT$46=\"D\",'MASTER SCOPES'!$E$69,'MASTER SCOPES'!$E$67))))","v":""},null,null,null,null,null,null,null,null,null,{"$f":"Survey!B45","v":"15.  Is ductwork lined?  If ductwork is lined, is it intact and undamaged?  If so, enter I.  If ductwork damaged and/or deteriorating, enter D.  If ductwork is not lined, enter NO."},null,null,null,null,{"$f":"'RTU7'!K21","v":0},{"$f":"IF(Survey!$BB$46=0,\"\",IF(Survey!$BB$46=\"N/A\",'MASTER SCOPES'!$E$68,IF(Survey!$BB$46=\"I\",'MASTER SCOPES'!$E$67,IF(Survey!$BB$46=\"D\",'MASTER SCOPES'!$E$69,'MASTER SCOPES'!$E$67))))","v":""},null,null,null,null,null,null,null,null,null,{"$f":"Survey!B45","v":"15.  Is ductwork lined?  If ductwork is lined, is it intact and undamaged?  If so, enter I.  If ductwork damaged and/or deteriorating, enter D.  If ductwork is not lined, enter NO."},null,null,null,null,{"$f":"'RTU8'!K21","v":0},{"$f":"IF(Survey!$BJ$46=0,\"\",IF(Survey!$BJ$46=\"N/A\",'MASTER SCOPES'!$E$68,IF(Survey!$BJ$46=\"I\",'MASTER SCOPES'!$E$67,IF(Survey!$BJ$46=\"D\",'MASTER SCOPES'!$E$69,'MASTER SCOPES'!$E$67))))","v":""}]
[null,{"$f":"Survey!B47","v":"16. Are turning vanes present in the supply ducts of the units?  If turning vanes present enter YES and if not enter NO."},null,null,null,null,{"$f":"'RTU1'!K23","v":"N/A"},{"$f":"IF(Survey!$F$48=0,\"\",IF(Survey!$F$48=\"N/A\",'MASTER SCOPES'!$E$73,IF(Survey!$F$48=\"YES\",'MASTER SCOPES'!$E$71,IF(Survey!$F$48=\"NO\",'MASTER SCOPES'!$E$72,\"\"))))","v":0},null,null,null,null,null,null,null,null,null,{"$f":"Survey!B47","v":"16. Are turning vanes present in the supply ducts of the units?  If turning vanes present enter YES and if not enter NO."},null,null,null,null,{"$f":"'RTU2'!K23","v":0},{"$f":"IF(Survey!$N$48=0,\"\",IF(Survey!$N$48=\"N/A\",'MASTER SCOPES'!$E$73,IF(Survey!$N$48=\"YES\",'MASTER SCOPES'!$E$71,IF(Survey!$N$48=\"NO\",'MASTER SCOPES'!$E$72,\"\"))))","v":""},null,null,null,null,null,null,null,null,null,{"$f":"Survey!B47","v":"16. Are turning vanes present in the supply ducts of the units?  If turning vanes present enter YES and if not enter NO."},null,null,null,null,{"$f":"'RTU3'!K23","v":0},{"$f":"IF(Survey!$V$48=0,\"\",IF(Survey!$V$48=\"N/A\",'MASTER SCOPES'!$E$73,IF(Survey!$V$48=\"YES\",'MASTER SCOPES'!$E$71,IF(Survey!$V$48=\"NO\",'MASTER SCOPES'!$E$72,\"\"))))","v":""},null,null,null,null,null,null,null,null,null,{"$f":"Survey!B47","v":"16. Are turning vanes present in the supply ducts of the units?  If turning vanes present enter YES and if not enter NO."},null,null,null,null,{"$f":"'RTU4'!K23","v":0},{"$f":"IF(Survey!$AD$48=0,\"\",IF(Survey!$AD$48=\"N/A\",'MASTER SCOPES'!$E$73,IF(Survey!$AD$48=\"YES\",'MASTER SCOPES'!$E$71,IF(Survey!$AD$48=\"NO\",'MASTER SCOPES'!$E$72,\"\"))))","v":""},null,null,null,null,null,null,null,null,null,{"$f":"Survey!B47","v":"16. Are turning vanes present in the supply ducts of the units?  If turning vanes present enter YES and if not enter NO."},null,null,null,null,{"$f":"'RTU5'!K23","v":0},{"$f":"IF(Survey!$AL$48=0,\"\",IF(Survey!$AL$48=\"N/A\",'MASTER SCOPES'!$E$73,IF(Survey!$AL$48=\"YES\",'MASTER SCOPES'!$E$71,IF(Survey!$AL$48=\"NO\",'MASTER SCOPES'!$E$72,\"\"))))","v":""},null,null,null,null,null,null,null,null,null,{"$f":"Survey!B47","v":"16. Are turning vanes present in the supply ducts of the units?  If turning vanes present enter YES and if not enter NO."},null,null,null,null,{"$f":"'RTU6'!K23","v":0},{"$f":"IF(Survey!$AT$48=0,\"\",IF(Survey!$AT$48=\"N/A\",'MASTER SCOPES'!$E$73,IF(Survey!$AT$48=\"YES\",'MASTER SCOPES'!$E$71,IF(Survey!$AT$48=\"NO\",'MASTER SCOPES'!$E$72,\"\"))))","v":""},null,null,null,null,null,null,null,null,null,{"$f":"Survey!B47","v":"16. Are turning vanes present in the supply ducts of the units?  If turning vanes present enter YES and if not enter NO."},null,null,null,null,{"$f":"'RTU7'!K22","v":0},{"$f":"IF(Survey!$BB$48=0,\"\",IF(Survey!$BB$48=\"N/A\",'MASTER SCOPES'!$E$73,IF(Survey!$BB$48=\"YES\",'MASTER SCOPES'!$E$71,IF(Survey!$BB$48=\"NO\",'MASTER SCOPES'!$E$72,\"\"))))","v":""},null,null,null,null,null,null,null,null,null,{"$f":"Survey!B47","v":"16. Are turning vanes present in the supply ducts of the units?  If turning vanes present enter YES and if not enter NO."},null,null,null,null,{"$f":"'RTU8'!K22","v":0},{"$f":"IF(Survey!$BJ$48=0,\"\",IF(Survey!$BJ$48=\"N/A\",'MASTER SCOPES'!$E$73,IF(Survey!$BJ$48=\"YES\",'MASTER SCOPES'!$E$71,IF(Survey!$BJ$48=\"NO\",'MASTER SCOPES'!$E$72,\"\"))))","v":""}]
[null,{"$f":"Survey!B49","v":"17. Are turning vanes single or double thickness?  If turning vanes double, enter D and if single enter S."},null,null,null,null,{"$f":"'RTU1'!K24","v":"N/A"},{"$f":"IF(Survey!$F$50=0,\"\",IF(Survey!$F$50=\"N/A\",'MASTER SCOPES'!$E$76,IF(Survey!$F$50=\"D\",'MASTER SCOPES'!$E$75,IF(Survey!$F$50=\"S\",'MASTER SCOPES'!$E$77,\"\"))))","v":0},null,null,null,null,null,null,null,null,null,{"$f":"Survey!B49","v":"17. Are turning vanes single or double thickness?  If turning vanes double, enter D and if single enter S."},null,null,null,null,{"$f":"'RTU2'!K24","v":""},{"$f":"IF(Survey!$N$50=0,\"\",IF(Survey!$N$50=\"N/A\",'MASTER SCOPES'!$E$76,IF(Survey!$N$50=\"D\",'MASTER SCOPES'!$E$75,IF(Survey!$N$50=\"S\",'MASTER SCOPES'!$E$77,\"\"))))","v":""},null,null,null,null,null,null,null,null,null,{"$f":"Survey!B49","v":"17. Are turning vanes single or double thickness?  If turning vanes double, enter D and if single enter S."},null,null,null,null,{"$f":"'RTU3'!K24","v":""},{"$f":"IF(Survey!$V$50=0,\"\",IF(Survey!$V$50=\"N/A\",'MASTER SCOPES'!$E$76,IF(Survey!$V$50=\"D\",'MASTER SCOPES'!$E$75,IF(Survey!$V$50=\"S\",'MASTER SCOPES'!$E$77,\"\"))))","v":""},null,null,null,null,null,null,null,null,null,{"$f":"Survey!B49","v":"17. Are turning vanes single or double thickness?  If turning vanes double, enter D and if single enter S."},null,null,null,null,{"$f":"'RTU4'!K24","v":""},{"$f":"IF(Survey!$AD$50=0,\"\",IF(Survey!$AD$50=\"N/A\",'MASTER SCOPES'!$E$76,IF(Survey!$AD$50=\"D\",'MASTER SCOPES'!$E$75,IF(Survey!$AD$50=\"S\",'MASTER SCOPES'!$E$77,\"\"))))","v":""},null,null,null,null,null,null,null,null,null,{"$f":"Survey!B49","v":"17. Are turning vanes single or double thickness?  If turning vanes double, enter D and if single enter S."},null,null,null,null,{"$f":"'RTU5'!K24","v":""},{"$f":"IF(Survey!$AL$50=0,\"\",IF(Survey!$AL$50=\"N/A\",'MASTER SCOPES'!$E$76,IF(Survey!$AL$50=\"D\",'MASTER SCOPES'!$E$75,IF(Survey!$AL$50=\"S\",'MASTER SCOPES'!$E$77,\"\"))))","v":""},null,null,null,null,null,null,null,null,null,{"$f":"Survey!B49","v":"17. Are turning vanes single or double thickness?  If turning vanes double, enter D and if single enter S."},null,null,null,null,{"$f":"'RTU6'!K24","v":""},{"$f":"IF(Survey!$AT$50=0,\"\",IF(Survey!$AT$50=\"N/A\",'MASTER SCOPES'!$E$76,IF(Survey!$AT$50=\"D\",'MASTER SCOPES'!$E$75,IF(Survey!$AT$50=\"S\",'MASTER SCOPES'!$E$77,\"\"))))","v":""},null,null,null,null,null,null,null,null,null,{"$f":"Survey!B49","v":"17. Are turning vanes single or double thickness?  If turning vanes double, enter D and if single enter S."},null,null,null,null,{"$f":"'RTU7'!K23","v":""},{"$f":"IF(Survey!$BB$50=0,\"\",IF(Survey!$BB$50=\"N/A\",'MASTER SCOPES'!$E$76,IF(Survey!$BB$50=\"D\",'MASTER SCOPES'!$E$75,IF(Survey!$BB$50=\"S\",'MASTER SCOPES'!$E$77,\"\"))))","v":""},null,null,null,null,null,null,null,null,null,{"$f":"Survey!B49","v":"17. Are turning vanes single or double thickness?  If turning vanes double, enter D and if single enter S."},null,null,null,null,{"$f":"'RTU8'!K23","v":"N/A"},{"$f":"IF(Survey!$BJ$50=0,\"\",IF(Survey!$BJ$50=\"N/A\",'MASTER SCOPES'!$E$76,IF(Survey!$BJ$50=\"D\",'MASTER SCOPES'!$E$75,IF(Survey!$BJ$50=\"S\",'MASTER SCOPES'!$E$77,\"\"))))","v":0}]
[null,{"$f":"Survey!B51","v":"18. Is canvas connector missing or damaged?  If no connector present, enter NO and if present enter YES.  If connector damaged enter D."},null,null,null,null,{"$f":"'RTU1'!K25","v":"N/A"},{"$f":"IF(Survey!$F$52=0,\"\",IF(Survey!$F$52=\"N/A\",'MASTER SCOPES'!$E$80,IF(Survey!$F$52=\"YES\",'MASTER SCOPES'!$E$79,IF(OR(Survey!$F$52=\"NO\",Survey!$F$52=\"D\"),'MASTER SCOPES'!$E$81))))","v":0},null,null,null,null,null,null,null,null,null,{"$f":"Survey!B51","v":"18. Is canvas connector missing or damaged?  If no connector present, enter NO and if present enter YES.  If connector damaged enter D."},null,null,null,null,{"$f":"'RTU2'!K25","v":0},{"$f":"IF(Survey!$N$52=0,\"\",IF(Survey!$N$52=\"N/A\",'MASTER SCOPES'!$E$80,IF(Survey!$N$52=\"YES\",'MASTER SCOPES'!$E$79,IF(OR(Survey!$N$52=\"NO\",Survey!$N$52=\"D\"),'MASTER SCOPES'!$E$81))))","v":""},null,null,null,null,null,null,null,null,null,{"$f":"Survey!B51","v":"18. Is canvas connector missing or damaged?  If no connector present, enter NO and if present enter YES.  If connector damaged enter D."},null,null,null,null,{"$f":"'RTU3'!K25","v":0},{"$f":"IF(Survey!$V$52=0,\"\",IF(Survey!$V$52=\"N/A\",'MASTER SCOPES'!$E$80,IF(Survey!$V$52=\"YES\",'MASTER SCOPES'!$E$79,IF(OR(Survey!$V$52=\"NO\",Survey!$V$52=\"D\"),'MASTER SCOPES'!$E$81))))","v":""},null,null,null,null,null,null,null,null,null,{"$f":"Survey!B51","v":"18. Is canvas connector missing or damaged?  If no connector present, enter NO and if present enter YES.  If connector damaged enter D."},null,null,null,null,{"$f":"'RTU4'!K25","v":0},{"$f":"IF(Survey!$AD$52=0,\"\",IF(Survey!$AD$52=\"N/A\",'MASTER SCOPES'!$E$80,IF(Survey!$AD$52=\"YES\",'MASTER SCOPES'!$E$79,IF(OR(Survey!$AD$52=\"NO\",Survey!$AN$52=\"D\"),'MASTER SCOPES'!$E$81))))","v":""},null,null,null,null,null,null,null,null,null,{"$f":"Survey!B51","v":"18. Is canvas connector missing or damaged?  If no connector present, enter NO and if present enter YES.  If connector damaged enter D."},null,null,null,null,{"$f":"'RTU5'!K25","v":0},{"$f":"IF(Survey!$AL$52=0,\"\",IF(Survey!$AL$52=\"N/A\",'MASTER SCOPES'!$E$80,IF(Survey!$AL$52=\"YES\",'MASTER SCOPES'!$E$79,IF(OR(Survey!$AL$52=\"NO\",Survey!$AL$52=\"D\"),'MASTER SCOPES'!$E$81))))","v":""},null,null,null,null,null,null,null,null,null,{"$f":"Survey!B51","v":"18. Is canvas connector missing or damaged?  If no connector present, enter NO and if present enter YES.  If connector damaged enter D."},null,null,null,null,{"$f":"'RTU6'!K25","v":0},{"$f":"IF(Survey!$AT$52=0,\"\",IF(Survey!$AT$52=\"N/A\",'MASTER SCOPES'!$E$80,IF(Survey!$AT$52=\"YES\",'MASTER SCOPES'!$E$79,IF(OR(Survey!$AT$52=\"NO\",Survey!$AT$52=\"D\"),'MASTER SCOPES'!$E$81))))","v":""},null,null,null,null,null,null,null,null,null,{"$f":"Survey!B51","v":"18. Is canvas connector missing or damaged?  If no connector present, enter NO and if present enter YES.  If connector damaged enter D."},null,null,null,null,{"$f":"'RTU7'!K24","v":0},{"$f":"IF(Survey!$BB$52=0,\"\",IF(Survey!$BB$52=\"N/A\",'MASTER SCOPES'!$E$80,IF(Survey!$BB$52=\"YES\",'MASTER SCOPES'!$E$79,IF(OR(Survey!$BB$52=\"NO\",Survey!$BB$52=\"D\"),'MASTER SCOPES'!$E$81))))","v":""},null,null,null,null,null,null,null,null,null,{"$f":"Survey!B51","v":"18. Is canvas connector missing or damaged?  If no connector present, enter NO and if present enter YES.  If connector damaged enter D."},null,null,null,null,{"$f":"'RTU8'!K24","v":0},{"$f":"IF(Survey!$BJ$52=0,\"\",IF(Survey!$BJ$52=\"N/A\",'MASTER SCOPES'!$E$80,IF(Survey!$BJ$52=\"YES\",'MASTER SCOPES'!$E$79,IF(OR(Survey!$BJ$52=\"NO\",Survey!$BJ$52=\"D\"),'MASTER SCOPES'!$E$81))))","v":""}]
[null,{"$f":"Survey!B53","v":"19.  If turning vanes not present, is drop radiused?  If so, does radius equal the width of the duct? If radius does not equal duct width, enter NO and if does enter YES."},null,null,null,null,{"$f":"'RTU1'!K26","v":"N/A"},{"$f":"IF(Survey!$F$54=0,\"\",IF(Survey!$F$54=\"N/A\",'MASTER SCOPES'!$E$84,IF(Survey!$F$54=\"YES\",'MASTER SCOPES'!$E$83,IF(Survey!$F$54=\"NO\",'MASTER SCOPES'!$E$85))))","v":0},null,null,null,null,null,null,null,null,null,{"$f":"Survey!B53","v":"19.  If turning vanes not present, is drop radiused?  If so, does radius equal the width of the duct? If radius does not equal duct width, enter NO and if does enter YES."},null,null,null,null,{"$f":"'RTU2'!K26","v":""},{"$f":"IF(Survey!$N$54=0,\"\",IF(Survey!$N$54=\"N/A\",'MASTER SCOPES'!$E$84,IF(Survey!$N$54=\"YES\",'MASTER SCOPES'!$E$83,IF(Survey!$N$54=\"NO\",'MASTER SCOPES'!$E$85))))","v":false},null,null,null,null,null,null,null,null,null,{"$f":"Survey!B53","v":"19.  If turning vanes not present, is drop radiused?  If so, does radius equal the width of the duct? If radius does not equal duct width, enter NO and if does enter YES."},null,null,null,null,{"$f":"'RTU3'!K26","v":""},{"$f":"IF(Survey!$V$54=0,\"\",IF(Survey!$V$54=\"N/A\",'MASTER SCOPES'!$E$84,IF(Survey!$V$54=\"YES\",'MASTER SCOPES'!$E$83,IF(Survey!$V$54=\"NO\",'MASTER SCOPES'!$E$85))))","v":false},null,null,null,null,null,null,null,null,null,{"$f":"Survey!B53","v":"19.  If turning vanes not present, is drop radiused?  If so, does radius equal the width of the duct? If radius does not equal duct width, enter NO and if does enter YES."},null,null,null,null,{"$f":"'RTU4'!K26","v":""},{"$f":"IF(Survey!$AD$54=0,\"\",IF(Survey!$AD$54=\"N/A\",'MASTER SCOPES'!$E$84,IF(Survey!$AD$54=\"YES\",'MASTER SCOPES'!$E$83,IF(Survey!$AD$54=\"NO\",'MASTER SCOPES'!$E$85))))","v":false},null,null,null,null,null,null,null,null,null,{"$f":"Survey!B53","v":"19.  If turning vanes not present, is drop radiused?  If so, does radius equal the width of the duct? If radius does not equal duct width, enter NO and if does enter YES."},null,null,null,null,{"$f":"'RTU5'!K26","v":""},{"$f":"IF(Survey!$AL$54=0,\"\",IF(Survey!$AL$54=\"N/A\",'MASTER SCOPES'!$E$84,IF(Survey!$AL$54=\"YES\",'MASTER SCOPES'!$E$83,IF(Survey!$AL$54=\"NO\",'MASTER SCOPES'!$E$85))))","v":false},null,null,null,null,null,null,null,null,null,{"$f":"Survey!B53","v":"19.  If turning vanes not present, is drop radiused?  If so, does radius equal the width of the duct? If radius does not equal duct width, enter NO and if does enter YES."},null,null,null,null,{"$f":"'RTU6'!K26","v":""},{"$f":"IF(Survey!$AT$54=0,\"\",IF(Survey!$AT$54=\"N/A\",'MASTER SCOPES'!$E$84,IF(Survey!$AT$54=\"YES\",'MASTER SCOPES'!$E$83,IF(Survey!$AT$54=\"NO\",'MASTER SCOPES'!$E$85))))","v":false},null,null,null,null,null,null,null,null,null,{"$f":"Survey!B53","v":"19.  If turning vanes not present, is drop radiused?  If so, does radius equal the width of the duct? If radius does not equal duct width, enter NO and if does enter YES."},null,null,null,null,{"$f":"'RTU7'!K25","v":""},{"$f":"IF(Survey!$BB$54=0,\"\",IF(Survey!$BB$54=\"N/A\",'MASTER SCOPES'!$E$84,IF(Survey!$BB$54=\"YES\",'MASTER SCOPES'!$E$83,IF(Survey!$BB$54=\"NO\",'MASTER SCOPES'!$E$85))))","v":false},null,null,null,null,null,null,null,null,null,{"$f":"Survey!B53","v":"19.  If turning vanes not present, is drop radiused?  If so, does radius equal the width of the duct? If radius does not equal duct width, enter NO and if does enter YES."},null,null,null,null,{"$f":"'RTU8'!K25","v":0},{"$f":"IF(Survey!$BJ$54=0,\"\",IF(Survey!$BJ$54=\"N/A\",'MASTER SCOPES'!$E$84,IF(Survey!$BJ$54=\"YES\",'MASTER SCOPES'!$E$83,IF(Survey!$BJ$54=\"NO\",'MASTER SCOPES'!$E$85))))","v":""}]
[null,{"$f":"Survey!B55","v":"20.  Check economizer setting at Master Control Boad.  If economizer set to zero, TAB to set the economizer position to the TAB sticker setpoint or damper shaft marking (If it exists) or to 20% open should no sticker or shaft marking exists.  If economizer doesn't stroke to desired position, enter \"D\" for deficiency.  If no deficiency enter ND."},null,null,null,null,{"$f":"'RTU1'!K27","v":0},{"$f":"IF(Survey!$F$56=0,\"\",IF(Survey!$F$56=\"N/A\",'MASTER SCOPES'!$E$88,IF(Survey!$F$56=\"ND\",'MASTER SCOPES'!$E$89,IF(Survey!$F$56=\"D\",'MASTER SCOPES'!$E$87))))","v":""},null,null,null,null,null,null,null,null,null,{"$f":"Survey!B55","v":"20.  Check economizer setting at Master Control Boad.  If economizer set to zero, TAB to set the economizer position to the TAB sticker setpoint or damper shaft marking (If it exists) or to 20% open should no sticker or shaft marking exists.  If economizer doesn't stroke to desired position, enter \"D\" for deficiency.  If no deficiency enter ND."},null,null,null,null,{"$f":"'RTU2'!K27","v":0},{"$f":"IF(Survey!$N$56=0,\"\",IF(Survey!$N$56=\"N/A\",'MASTER SCOPES'!$E$88,IF(Survey!$N$56=\"ND\",'MASTER SCOPES'!$E$89,IF(Survey!$N$56=\"D\",'MASTER SCOPES'!$E$87))))","v":""},null,null,null,null,null,null,null,null,null,{"$f":"Survey!B55","v":"20.  Check economizer setting at Master Control Boad.  If economizer set to zero, TAB to set the economizer position to the TAB sticker setpoint or damper shaft marking (If it exists) or to 20% open should no sticker or shaft marking exists.  If economizer doesn't stroke to desired position, enter \"D\" for deficiency.  If no deficiency enter ND."},null,null,null,null,{"$f":"'RTU3'!K27","v":0},{"$f":"IF(Survey!$V$56=0,\"\",IF(Survey!$V$56=\"N/A\",'MASTER SCOPES'!$E$88,IF(Survey!$V$56=\"ND\",'MASTER SCOPES'!$E$89,IF(Survey!$V$56=\"D\",'MASTER SCOPES'!$E$87))))","v":""},null,null,null,null,null,null,null,null,null,{"$f":"Survey!B55","v":"20.  Check economizer setting at Master Control Boad.  If economizer set to zero, TAB to set the economizer position to the TAB sticker setpoint or damper shaft marking (If it exists) or to 20% open should no sticker or shaft marking exists.  If economizer doesn't stroke to desired position, enter \"D\" for deficiency.  If no deficiency enter ND."},null,null,null,null,{"$f":"'RTU4'!K27","v":0},{"$f":"IF(Survey!$AD$56=0,\"\",IF(Survey!$AD$56=\"N/A\",'MASTER SCOPES'!$E$88,IF(Survey!$AD$56=\"ND\",'MASTER SCOPES'!$E$89,IF(Survey!$AD$56=\"D\",'MASTER SCOPES'!$E$87))))","v":""},null,null,null,null,null,null,null,null,null,{"$f":"Survey!B55","v":"20.  Check economizer setting at Master Control Boad.  If economizer set to zero, TAB to set the economizer position to the TAB sticker setpoint or damper shaft marking (If it exists) or to 20% open should no sticker or shaft marking exists.  If economizer doesn't stroke to desired position, enter \"D\" for deficiency.  If no deficiency enter ND."},null,null,null,null,{"$f":"'RTU5'!K27","v":0},{"$f":"IF(Survey!$AL$56=0,\"\",IF(Survey!$AL$56=\"N/A\",'MASTER SCOPES'!$E$88,IF(Survey!$AL$56=\"ND\",'MASTER SCOPES'!$E$89,IF(Survey!$AL$56=\"D\",'MASTER SCOPES'!$E$87))))","v":""},null,null,null,null,null,null,null,null,null,{"$f":"Survey!B55","v":"20.  Check economizer setting at Master Control Boad.  If economizer set to zero, TAB to set the economizer position to the TAB sticker setpoint or damper shaft marking (If it exists) or to 20% open should no sticker or shaft marking exists.  If economizer doesn't stroke to desired position, enter \"D\" for deficiency.  If no deficiency enter ND."},null,null,null,null,{"$f":"'RTU6'!K27","v":0},{"$f":"IF(Survey!$AT$56=0,\"\",IF(Survey!$AT$56=\"N/A\",'MASTER SCOPES'!$E$88,IF(Survey!$AT$56=\"ND\",'MASTER SCOPES'!$E$89,IF(Survey!$AT$56=\"D\",'MASTER SCOPES'!$E$87))))","v":""},null,null,null,null,null,null,null,null,null,{"$f":"Survey!B55","v":"20.  Check economizer setting at Master Control Boad.  If economizer set to zero, TAB to set the economizer position to the TAB sticker setpoint or damper shaft marking (If it exists) or to 20% open should no sticker or shaft marking exists.  If economizer doesn't stroke to desired position, enter \"D\" for deficiency.  If no deficiency enter ND."},null,null,null,null,{"$f":"'RTU7'!K26","v":0},{"$f":"IF(Survey!$BB$56=0,\"\",IF(Survey!$BB$56=\"N/A\",'MASTER SCOPES'!$E$88,IF(Survey!$BB$56=\"ND\",'MASTER SCOPES'!$E$89,IF(Survey!$BB$56=\"D\",'MASTER SCOPES'!$E$87))))","v":""},null,null,null,null,null,null,null,null,null,{"$f":"Survey!B55","v":"20.  Check economizer setting at Master Control Boad.  If economizer set to zero, TAB to set the economizer position to the TAB sticker setpoint or damper shaft marking (If it exists) or to 20% open should no sticker or shaft marking exists.  If economizer doesn't stroke to desired position, enter \"D\" for deficiency.  If no deficiency enter ND."},null,null,null,null,{"$f":"'RTU8'!K26","v":0},{"$f":"IF(Survey!$BJ$56=0,\"\",IF(Survey!$BJ$56=\"N/A\",'MASTER SCOPES'!$E$88,IF(Survey!$BJ$56=\"ND\",'MASTER SCOPES'!$E$89,IF(Survey!$BJ$56=\"D\",'MASTER SCOPES'!$E$87))))","v":""}]
[null,{"$f":"Survey!B57","v":"21.  Provide condensation pipe size.  Minimum 1\" at playland unit, and 1.25\" at all other units.  NOTE: DROP DOWN MENUS FOR PIPE SIZE."},null,null,null,null,{"$f":"'RTU1'!K28","v":0},{"$f":"IF(Survey!$F$58=0,\"\",IF(Survey!$F$58=\"N/A\",\"\",IF(Survey!$F$58<1.25,'MASTER SCOPES'!$E$92,'MASTER SCOPES'!$E$91)))","v":""},null,null,null,null,null,null,null,null,null,{"$f":"Survey!B57","v":"21.  Provide condensation pipe size.  Minimum 1\" at playland unit, and 1.25\" at all other units.  NOTE: DROP DOWN MENUS FOR PIPE SIZE."},null,null,null,null,{"$f":"'RTU2'!K28","v":0},{"$f":"IF(Survey!$N$58=0,\"\",IF(Survey!$N$58=\"N/A\",\"\",IF(Survey!$N$58<1.25,'MASTER SCOPES'!$E$92,'MASTER SCOPES'!$E$91)))","v":""},null,null,null,null,null,null,null,null,null,{"$f":"Survey!B57","v":"21.  Provide condensation pipe size.  Minimum 1\" at playland unit, and 1.25\" at all other units.  NOTE: DROP DOWN MENUS FOR PIPE SIZE."},null,null,null,null,{"$f":"'RTU3'!K28","v":0},{"$f":"IF(Survey!$V$58=0,\"\",IF(Survey!$V$58=\"N/A\",\"\",IF(Survey!$V$58<1.25,'MASTER SCOPES'!$E$92,'MASTER SCOPES'!$E$91)))","v":""},null,null,null,null,null,null,null,null,null,{"$f":"Survey!B57","v":"21.  Provide condensation pipe size.  Minimum 1\" at playland unit, and 1.25\" at all other units.  NOTE: DROP DOWN MENUS FOR PIPE SIZE."},null,null,null,null,{"$f":"'RTU4'!K28","v":0},{"$f":"IF(Survey!$AD$58=0,\"\",IF(Survey!$AD$58=\"N/A\",\"\",IF(Survey!$AD$58<1.25,'MASTER SCOPES'!$E$92,'MASTER SCOPES'!$E$91)))","v":""},null,null,null,null,null,null,null,null,null,{"$f":"Survey!B57","v":"21.  Provide condensation pipe size.  Minimum 1\" at playland unit, and 1.25\" at all other units.  NOTE: DROP DOWN MENUS FOR PIPE SIZE."},null,null,null,null,{"$f":"'RTU5'!K28","v":0},{"$f":"IF(Survey!$AL$58=0,\"\",IF(Survey!$AL$58=\"N/A\",\"\",IF(Survey!$AL$58<1.25,'MASTER SCOPES'!$E$92,'MASTER SCOPES'!$E$91)))","v":""},null,null,null,null,null,null,null,null,null,{"$f":"Survey!B57","v":"21.  Provide condensation pipe size.  Minimum 1\" at playland unit, and 1.25\" at all other units.  NOTE: DROP DOWN MENUS FOR PIPE SIZE."},null,null,null,null,{"$f":"'RTU6'!K28","v":0},{"$f":"IF(Survey!$AT$58=0,\"\",IF(Survey!$AT$58=\"N/A\",\"\",IF(Survey!$AT$58<1.25,'MASTER SCOPES'!$E$92,'MASTER SCOPES'!$E$91)))","v":""},null,null,null,null,null,null,null,null,null,{"$f":"Survey!B57","v":"21.  Provide condensation pipe size.  Minimum 1\" at playland unit, and 1.25\" at all other units.  NOTE: DROP DOWN MENUS FOR PIPE SIZE."},null,null,null,null,{"$f":"'RTU7'!K27","v":0},{"$f":"IF(Survey!$BB$58=0,\"\",IF(Survey!$BB$58=\"N/A\",\"\",IF(Survey!$BB$58<1.25,'MASTER SCOPES'!$E$92,'MASTER SCOPES'!$E$91)))","v":""},null,null,null,null,null,null,null,null,null,{"$f":"Survey!B57","v":"21.  Provide condensation pipe size.  Minimum 1\" at playland unit, and 1.25\" at all other units.  NOTE: DROP DOWN MENUS FOR PIPE SIZE."},null,null,null,null,{"$f":"'RTU8'!K27","v":0},{"$f":"IF(Survey!$BJ$58=0,\"\",IF(Survey!$BJ$58=\"N/A\",\"\",IF(Survey!$BJ$58<1.25,'MASTER SCOPES'!$E$92,'MASTER SCOPES'!$E$91)))","v":""}]
[null,{"$f":"Survey!B59","v":"22.  Incorrect MFR of devices or equipment installed that does not match CFA specifications.  If incorrect manufacturer devices found, enter YES and decribe deficiency in miscellaneous notes.  If not enter NO."},null,null,null,null,{"$f":"'RTU1'!K29","v":"N/A"},{"$f":"IF(Survey!$F$60=0,\"\",IF(Survey!$F$60=\"N/A\",'MASTER SCOPES'!$E$95,IF(Survey!$F$60=\"YES\",'MASTER SCOPES'!$E$94,'MASTER SCOPES'!$E$96)))","v":0},null,null,null,null,null,null,null,null,null,{"$f":"Survey!B59","v":"22.  Incorrect MFR of devices or equipment installed that does not match CFA specifications.  If incorrect manufacturer devices found, enter YES and decribe deficiency in miscellaneous notes.  If not enter NO."},null,null,null,null,{"$f":"'RTU2'!K29","v":0}," ",null,null,null,null,null,null,null,null,null,{"$f":"Survey!B59","v":"22.  Incorrect MFR of devices or equipment installed that does not match CFA specifications.  If incorrect manufacturer devices found, enter YES and decribe deficiency in miscellaneous notes.  If not enter NO."},null,null,null,null,{"$f":"'RTU3'!K29","v":0},{"$f":"IF(Survey!$V$60=0,\"\",IF(Survey!$V$60=\"N/A\",'MASTER SCOPES'!$E$95,IF(Survey!$V$60=\"YES\",'MASTER SCOPES'!$E$94,'MASTER SCOPES'!$E$96)))","v":""},null,null,null,null,null,null,null,null,null,{"$f":"Survey!B59","v":"22.  Incorrect MFR of devices or equipment installed that does not match CFA specifications.  If incorrect manufacturer devices found, enter YES and decribe deficiency in miscellaneous notes.  If not enter NO."},null,null,null,null,{"$f":"'RTU4'!K29","v":0},{"$f":"IF(Survey!$AD$60=0,\"\",IF(Survey!$AD$60=\"N/A\",'MASTER SCOPES'!$E$98,IF(Survey!$AD$60=\"YES\",'MASTER SCOPES'!$E$94,'MASTER SCOPES'!$E$96)))","v":""},null,null,null,null,null,null,null,null,null,{"$f":"Survey!B59","v":"22.  Incorrect MFR of devices or equipment installed that does not match CFA specifications.  If incorrect manufacturer devices found, enter YES and decribe deficiency in miscellaneous notes.  If not enter NO."},null,null,null,null,{"$f":"'RTU5'!K29","v":0},{"$f":"IF(Survey!$AL$60=0,\"\",IF(Survey!$AL$60=\"N/A\",'MASTER SCOPES'!$E$95,IF(Survey!$AL$60=\"YES\",'MASTER SCOPES'!$E$94,'MASTER SCOPES'!$E$96)))","v":""},null,null,null,null,null,null,null,null,null,{"$f":"Survey!B59","v":"22.  Incorrect MFR of devices or equipment installed that does not match CFA specifications.  If incorrect manufacturer devices found, enter YES and decribe deficiency in miscellaneous notes.  If not enter NO."},null,null,null,null,{"$f":"'RTU6'!K29","v":0},{"$f":"IF(Survey!$AT$60=0,\"\",IF(Survey!$AT$60=\"N/A\",'MASTER SCOPES'!$E$95,IF(Survey!$AT$60=\"YES\",'MASTER SCOPES'!$E$94,'MASTER SCOPES'!$E$96)))","v":""},null,null,null,null,null,null,null,null,null,{"$f":"Survey!B59","v":"22.  Incorrect MFR of devices or equipment installed that does not match CFA specifications.  If incorrect manufacturer devices found, enter YES and decribe deficiency in miscellaneous notes.  If not enter NO."},null,null,null,null,{"$f":"'RTU7'!K28","v":0},{"$f":"IF(Survey!$BB$60=0,\"\",IF(Survey!$BB$60=\"N/A\",'MASTER SCOPES'!$E$95,IF(Survey!$BB$60=\"YES\",'MASTER SCOPES'!$E$94,'MASTER SCOPES'!$E$96)))","v":""},null,null,null,null,null,null,null,null,null,{"$f":"Survey!B59","v":"22.  Incorrect MFR of devices or equipment installed that does not match CFA specifications.  If incorrect manufacturer devices found, enter YES and decribe deficiency in miscellaneous notes.  If not enter NO."},null,null,null,null,{"$f":"'RTU8'!K28","v":0},{"$f":"IF(Survey!$BJ$60=0,\"\",IF(Survey!$BJ$60=\"N/A\",'MASTER SCOPES'!$E$95,IF(Survey!$BJ$60=\"YES\",'MASTER SCOPES'!$E$94,'MASTER SCOPES'!$E$96)))","v":""}]
[null,{"$f":"Survey!B72","v":"8.  Are thermostats Robert Shaw (Gray Display) or Network (Blue Display)? Enter \"RS\", \"NW\" for Robert Shaw and Network respectively.  If thermostat not Robert Shaw or Network enter NO."},null,null,null,null,{"$f":"'EF Thermostat'!C16","v":0},{"$f":"IF(Survey!$J$73=0,\"\",IF(Survey!$J$73=\"N/A\",'MASTER SCOPES'!$E$99,IF(OR(Survey!$J$73=\"NW\",Survey!$J$73=\"RS\"),'MASTER SCOPES'!$E$98,IF(Survey!$J$73=\"NO\",'MASTER SCOPES'!$E$100,\"\"))))","v":""},null,null,null,null,null,null,null,null,null,{"$f":"Survey!B72","v":"8.  Are thermostats Robert Shaw (Gray Display) or Network (Blue Display)? Enter \"RS\", \"NW\" for Robert Shaw and Network respectively.  If thermostat not Robert Shaw or Network enter NO."},null,null,null,null,{"$f":"'EF Thermostat'!E16","v":0},{"$f":"IF(Survey!$Z$73=0,\"\",IF(Survey!$Z$73=\"N/A\",'MASTER SCOPES'!$E$99,IF(OR(Survey!$Z$73=\"NW\",Survey!$Z$73=\"RS\"),'MASTER SCOPES'!$E$98,IF(Survey!$Z$73=\"NO\",'MASTER SCOPES'!$E$100,\"\"))))","v":""},null,null,null,null,null,null,null,null,null,{"$f":"Survey!B72","v":"8.  Are thermostats Robert Shaw (Gray Display) or Network (Blue Display)? Enter \"RS\", \"NW\" for Robert Shaw and Network respectively.  If thermostat not Robert Shaw or Network enter NO."},null,null,null,null,{"$f":"'EF Thermostat'!G16","v":0},{"$f":"IF(Survey!$AP$73=0,\"\",IF(Survey!$AP$73=\"N/A\",'MASTER SCOPES'!$E$99,IF(OR(Survey!$AP$73=\"NW\",Survey!$AP$73=\"RS\"),'MASTER SCOPES'!$E$98,IF(Survey!$AP$73=\"NO\",'MASTER SCOPES'!$E$100,\"\"))))","v":""},null,null,null,null,null,null,null,null,null,{"$f":"Survey!B72","v":"8.  Are thermostats Robert Shaw (Gray Display) or Network (Blue Display)? Enter \"RS\", \"NW\" for Robert Shaw and Network respectively.  If thermostat not Robert Shaw or Network enter NO."},null,null,null,null,{"$f":"'EF Thermostat'!I16","v":"RS"},{"$f":"IF(Survey!$BF$73=0,\"\",IF(Survey!$BF$73=\"N/A\",'MASTER SCOPES'!$E$99,IF(OR(Survey!$BF$73=\"NW\",Survey!$BF$73=\"RS\"),'MASTER SCOPES'!$E$98,IF(Survey!$BF$73=\"NO\",'MASTER SCOPES'!$E$100,\"\"))))","v":"No action required."},null,null,null,null,null,null,null,null,null,{"$f":"Survey!B72","v":"8.  Are thermostats Robert Shaw (Gray Display) or Network (Blue Display)? Enter \"RS\", \"NW\" for Robert Shaw and Network respectively.  If thermostat not Robert Shaw or Network enter NO."},null,null,null,null,{"$f":"'EF Thermostat'!K16","v":0},{"$f":"IF(Survey!$J$74=0,\"\",IF(Survey!$J$74=\"N/A\",'MASTER SCOPES'!$E$99,IF(OR(Survey!$J$74=\"NW\",Survey!$J$74=\"RS\"),'MASTER SCOPES'!$E$98,IF(Survey!$J$74=\"NO\",'MASTER SCOPES'!$E$100,\"\"))))","v":""},null,null,null,null,null,null,null,null,null,{"$f":"Survey!B72","v":"8.  Are thermostats Robert Shaw (Gray Display) or Network (Blue Display)? Enter \"RS\", \"NW\" for Robert Shaw and Network respectively.  If thermostat not Robert Shaw or Network enter NO."},null,null,null,null,{"$f":"'EF Thermostat'!C17","v":0},{"$f":"IF(Survey!$Z$74=0,\"\",IF(Survey!$Z$74=\"N/A\",'MASTER SCOPES'!$E$99,IF(OR(Survey!$Z$74=\"NW\",Survey!$Z$74=\"RS\"),'MASTER SCOPES'!$E$98,IF(Survey!$Z$74=\"NO\",'MASTER SCOPES'!$E$100,\"\"))))","v":""},null,null,null,null,null,null,null,null,null,{"$f":"Survey!B72","v":"8.  Are thermostats Robert Shaw (Gray Display) or Network (Blue Display)? Enter \"RS\", \"NW\" for Robert Shaw and Network respectively.  If thermostat not Robert Shaw or Network enter NO."},null,null,null,null,{"$f":"'EF Thermostat'!E17","v":0},{"$f":"IF(Survey!$AP$74=0,\"\",IF(Survey!$AP$74=\"N/A\",'MASTER SCOPES'!$E$99,IF(OR(Survey!$AP$74=\"NW\",Survey!$AP$74=\"RS\"),'MASTER SCOPES'!$E$98,IF(Survey!$AP$74=\"NO\",'MASTER SCOPES'!$E$100,\"\"))))","v":""},null,null,null,null,null,null,null,null,null,{"$f":"Survey!B72","v":"8.  Are thermostats Robert Shaw (Gray Display) or Network (Blue Display)? Enter \"RS\", \"NW\" for Robert Shaw and Network respectively.  If thermostat not Robert Shaw or Network enter NO."},null,null,null,null,{"$f":"'EF Thermostat'!G17","v":0},{"$f":"IF(Survey!$BF$74=0,\"\",IF(Survey!$BF$74=\"N/A\",'MASTER SCOPES'!$E$99,IF(OR(Survey!$BF$74=\"NW\",Survey!$BF$74=\"RS\"),'MASTER SCOPES'!$E$98,IF(Survey!$BF$74=\"NO\",'MASTER SCOPES'!$E$100,\"\"))))","v":""}]
[null,"MISCELLENOUS NOTES",null,null,null,null,null,null,null,null,null,null,null,null,null,null,null,"MISCELLENOUS NOTES",null,null,null,null,null,null,null,null,null,null,null,null,null,null,null,"MISCELLENOUS NOTES",null,null,null,null,null,null,null,null,null,null,null,null,null,null,null,"MISCELLENOUS NOTES",null,null,null,null,null,null,null,null,null,null,null,null,null,null,null,"MISCELLENOUS NOTES",null,null,null,null,null,null,null,null,null,null,null,null,null,null,null,"MISCELLENOUS NOTES",null,null,null,null,null,null,null,null,null,null,null,null,null,null,null,"MISCELLENOUS NOTES",null,null,null,null,null,null,null,null,null,null,null,null,null,null,null,"MISCELLENOUS NOTES"]

{"sheet":"EF SCOPE","index":3,"n_rows":39,"n_cols":10,"rows_kept":39,"cut":false,"hidden":false,"merged":[[37,1,37,10],[29,1,29,10],[21,1,21,10],[22,6,22,10],[22,1,22,4],[23,1,23,4],[23,6,23,10],[24,1,24,4],[24,6,24,10],[25,1,25,10],[26,1,26,10],[27,1,27,10],[30,1,30,4],[30,6,30,10],[34,1,34,10],[35,1,35,10],[38,1,38,4],[38,6,38,10],[0,1,0,10],[13,1,13,10],[5,1,5,10],[1,2,1,3],[1,4,1,6],[1,7,1,8],[2,2,2,3],[2,4,2,6],[2,7,2,8],[6,1,6,4],[11,1,11,10],[14,1,14,4],[14,6,14,10],[15,6,15,10],[15,1,15,4],[6,6,6,10],[9,1,9,10],[10,1,10,10],[7,1,7,4],[7,6,7,10],[8,1,8,4],[8,6,8,10],[16,1,16,4],[16,6,16,10],[17,1,17,10],[18,1,18,10],[19,1,19,10],[31,1,31,4],[31,6,31,10],[32,1,32,4],[32,6,32,10],[33,1,33,10]]}
[null,"REINVESTMENT CONDITION SURVEY SCOPE OF WORK"]
[null,"UNIT #","NAME",null,"ADDRESS",null,null,"CITY",null,"STATE"]
[null,{"$f":"Survey!B3","v":2233},{"$f":"Survey!F3","v":"Bristow FSU"},null,{"$f":"Survey!T3","v":"9939 Sowder Village Sq"},null,null,{"$f":"Survey!AG3","v":"Manassas"},null,{"$f":"Survey!AR3","v":"VA"}]
[]
[]
[null,"EXHAUST FAN ONE"]
[1,{"$f":"Survey!B62","v":"1.  Incorrect MFR of devices or equipment installed that does not match CFA specifications.  If incorrect manufacturer devices found, enter YES and decribe deficiency in miscellaneous note E#.  If not enter NO."},null,null,null,{"$f":"'EF Thermostat'!C6","v":0},{"$f":"IF(Survey!$V$63=0,\"\",IF(Survey!$V$63=\"NO\",'MASTER SCOPES'!E103,IF(Survey!$V$63=\"YES\",'MASTER SCOPES'!E102,\"\")))","v":""}]
[2,{"$f":"Survey!B64","v":"2.  Loose or missing access doors or gasketes on the grease ductwork.  Grease exhaust duct dampers - Halton Kitchen Volume Damper.  If issues found with access doors, enter YES and describe in miscelleneous note E#a.  If no issues, enter NO.  If gaskets missing enter MG."},null,null,null,{"$f":"'EF Thermostat'!C8","v":0},{"$f":"IF(Survey!$V$65=0,\"\",IF(Survey!$V$65=\"NO\",'MASTER SCOPES'!E105,IF(Survey!$V$65=\"YES\",'MASTER SCOPES'!E104,IF(Survey!$V$65=\"MG\",'MASTER SCOPES'!E106,\"\"))))","v":""}]
[3,{"$f":"Survey!B66","v":"3.  Exhaust System - Wrong HP motor in rooftop exhaust equipment.  If incorrect HP, enter YES and if correct enter NO."},null,null,null,{"$f":"'EF Thermostat'!C10","v":0},{"$f":"IF(Survey!$V$67=0,\"\",IF(Survey!$V$67=\"NO\",'MASTER SCOPES'!E108,IF(Survey!$V$67=\"YES\",'MASTER SCOPES'!E107,\"\")))","v":""}]
[null,"EXHAUST FAN ONE MISCELLENEOUS NOTE"]
[null,{"$f":"'EF Thermostat'!$C$19","v":0}]
[null,{"$f":"'EF Thermostat'!C20","v":0}]
[]
[null,"EXHAUST FAN TWO"]
[1,{"$f":"Survey!B62","v":"1.  Incorrect MFR of devices or equipment installed that does not match CFA specifications.  If incorrect manufacturer devices found, enter YES and decribe deficiency in miscellaneous note E#.  If not enter NO."},null,null,null,{"$f":"'EF Thermostat'!E6","v":0},{"$f":"IF(Survey!$AB$63=0,\"\",IF(Survey!$AB$63=\"NO\",'MASTER SCOPES'!E103,IF(Survey!$AB$63=\"YES\",'MASTER SCOPES'!E102,\"\")))","v":""}]
[2,{"$f":"Survey!B64","v":"2.  Loose or missing access doors or gasketes on the grease ductwork.  Grease exhaust duct dampers - Halton Kitchen Volume Damper.  If issues found with access doors, enter YES and describe in miscelleneous note E#a.  If no issues, enter NO.  If gaskets missing enter MG."},null,null,null,{"$f":"'EF Thermostat'!E8","v":0},{"$f":"IF(Survey!$AB$65=0,\"\",IF(Survey!$AB$65=\"NO\",'MASTER SCOPES'!E105,IF(Survey!$AB$65=\"YES\",'MASTER SCOPES'!E104,IF(Survey!$AB$65=\"MG\",'MASTER SCOPES'!E106,\"\"))))","v":""}]
[3,{"$f":"Survey!B66","v":"3.  Exhaust System - Wrong HP motor in rooftop exhaust equipment.  If incorrect HP, enter YES and if correct enter NO."},null,null,null,{"$f":"'EF Thermostat'!E10","v":0},{"$f":"IF(Survey!$AB$67=0,\"\",IF(Survey!$AB$67=\"NO\",'MASTER SCOPES'!E108,IF(Survey!$AB$67=\"YES\",'MASTER SCOPES'!E107,\"\")))","v":""}]
[null,"EXHAUST FAN TWO MISCELLENEOUS NOTE"]
[null,{"$f":"'EF Thermostat'!$C$21","v":0}]
[null,{"$f":"'EF Thermostat'!C22","v":0}]
[]
[null,"EXHAUST FAN THREE"]
[1,{"$f":"Survey!B62","v":"1.  Incorrect MFR of devices or equipment installed that does not match CFA specifications.  If incorrect manufacturer devices found, enter YES and decribe deficiency in miscellaneous note E#.  If not enter NO."},null,null,null,{"$f":"'EF Thermostat'!G6","v":0},{"$f":"IF(Survey!$AH$63=0,\"\",IF(Survey!$AH$63=\"NO\",'MASTER SCOPES'!E103,IF(Survey!$AH$63=\"YES\",'MASTER SCOPES'!E102,\"\")))","v":""}]
[2,{"$f":"Survey!B64","v":"2.  Loose or missing access doors or gasketes on the grease ductwork.  Grease exhaust duct dampers - Halton Kitchen Volume Damper.  If issues found with access doors, enter YES and describe in miscelleneous note E#a.  If no issues, enter NO.  If gaskets missing enter MG."},null,null,null,{"$f":"'EF Thermostat'!G8","v":0},{"$f":"IF(Survey!$AH$65=0,\"\",IF(Survey!$AH$65=\"NO\",'MASTER SCOPES'!E105,IF(Survey!$AH$65=\"YES\",'MASTER SCOPES'!E104,IF(Survey!$AH$65=\"MG\",\"1.  Replace missing gasket.\",\"\"))))","v":""}]
[3,{"$f":"Survey!B66","v":"3.  Exhaust System - Wrong HP motor in rooftop exhaust equipment.  If incorrect HP, enter YES and if correct enter NO."},null,null,null,{"$f":"'EF Thermostat'!G10","v":0},{"$f":"IF(Survey!$AH$67=0,\"\",IF(Survey!$AH$67=\"NO\",'MASTER SCOPES'!E108,IF(Survey!$AH$67=\"YES\",'MASTER SCOPES'!E107,\"\")))","v":""}]
[null,"EXHAUST FAN THREE MISCELLENEOUS NOTE"]
[null,{"$f":"'EF Thermostat'!C23","v":0}]
[null,{"$f":"'EF Thermostat'!C24","v":0}]
[]
[null,"EXHAUST FAN FOUR"]
[1,{"$f":"Survey!B62","v":"1.  Incorrect MFR of devices or equipment installed that does not match CFA specifications.  If incorrect manufacturer devices found, enter YES and decribe deficiency in miscellaneous note E#.  If not enter NO."},null,null,null,{"$f":"'EF Thermostat'!I6","v":0},{"$f":"IF(Survey!$Z$63=0,\"\",IF(Survey!$Z$63=\"NO\",'MASTER SCOPES'!E103,IF(Survey!$Z$63=\"YES\",'MASTER SCOPES'!E102,\"\")))","v":""}]
[2,{"$f":"Survey!B64","v":"2.  Loose or missing access doors or gasketes on the grease ductwork.  Grease exhaust duct dampers - Halton Kitchen Volume Damper.  If issues found with access doors, enter YES and describe in miscelleneous note E#a.  If no issues, enter NO.  If gaskets missing enter MG."},null,null,null,{"$f":"'EF Thermostat'!I8","v":0},{"$f":"IF(Survey!$AN$65=0,\"\",IF(Survey!$AN$65=\"NO\",'MASTER SCOPES'!E105,IF(Survey!$AN$65=\"YES\",'MASTER SCOPES'!E104,IF(Survey!$AN$65=\"MG\",'MASTER SCOPES'!E106,\"\"))))","v":""}]
[3,{"$f":"Survey!B66","v":"3.  Exhaust System - Wrong HP motor in rooftop exhaust equipment.  If incorrect HP, enter YES and if correct enter NO."},null,null,null,{"$f":"'EF Thermostat'!I10","v":0},{"$f":"IF(Survey!$AN$67=0,\"\",IF(Survey!$AN$67=\"NO\",'MASTER SCOPES'!E108,IF(Survey!$AN$67=\"YES\",'MASTER SCOPES'!E107,\"\")))","v":""}]
[null,"EXHAUST FAN FOUR MISCELLENEOUS NOTE"]
[null,{"$f":"'EF Thermostat'!C25","v":0}]
[null,{"$f":"'EF Thermostat'!C26","v":0}]
[]
[null,"BATHROOM EXHAUST FAN"]
[null,{"$f":"Survey!B68","v":"4.  Does bathroom exhaust fan duct have a liner?  Enter YES or NO."},null,null,null,{"$f":"'EF Thermostat'!K11","v":0},{"$f":"IF(Survey!$AN$68=0,\"\",IF(Survey!$AN$68=\"N/A\",\"\",IF(Survey!$AN$68=\"YES\",'MASTER SCOPES'!E109,IF(Survey!$AN$68=\"NO\",'MASTER SCOPES'!E110,\"\"))))","v":""}]

{"sheet":"RTU1","index":4,"n_rows":30,"n_cols":13,"rows_kept":30,"cut":false,"hidden":false,"merged":[[30,1,30,10],[18,1,18,8],[11,1,11,8],[29,1,29,10],[28,1,28,8],[14,1,14,8],[12,1,12,8],[1,5,1,9],[19,1,19,8],[25,1,25,8],[2,5,2,9],[24,1,24,8],[7,1,7,8],[8,1,8,8],[13,1,13,8],[4,7,4,8],[9,1,9,8],[10,1,10,8],[4,4,4,5],[4,1,4,3],[5,1,5,8],[6,1,6,8],[17,1,17,8],[31,1,31,10],[32,1,32,10],[0,1,0,4],[1,1,1,4],[2,1,2,4],[3,1,3,4],[27,1,27,8],[26,1,26,8],[22,1,22,8],[23,1,23,8],[20,1,20,8],[21,1,21,8],[15,1,15,8],[16,1,16,8],[0,5,0,9],[3,5,3,9]]}
[null,"RTU UNIT MANUFACTURER",null,null,null,{"$f":"Survey!AA9","v":"Lennox"}]
[null,"RTU TYPE",null,null,null,{"$f":"Survey!AI9","v":"ENERGENCE"}]
[null,"MODEL NUMBER",null,null,null,{"$f":"Survey!M9","v":"LGH180H4BH4Y"}]
[null,"SERIAL NUMBER",null,null,null,{"$f":"Survey!F9","v":"05621J05571"}]
[null,null,null,null,"RTU AGE",null,{"$f":"Survey!AF9","v":4.3123287671232875},"RTU TONNAGE",null,{"$f":"Survey!X9","v":"15"}]
[null,"DESCRIPTION",null,null,null,null,null,null,null,"CODE OUTPUT","ANSWER"]
[null,{"$f":"Survey!B17","v":"1.  Using punch/screwdriver, prod heat exchanger tubes.  If holes found and/or prod test fails enter YES, lockout unit and infom management. If not, enter NO."},null,null,null,null,null,null,null,{"$f":"IF(ISBLANK(Survey!$F$9),\"N/A\",\"\")","v":""}]
[null,{"$f":"Survey!B19","v":"2.  Quantify damage/deterioration to the condenser coil, and enter value 0% to 100%."},null,null,null,null,null,null,null,{"$f":"IF(ISBLANK(Survey!$F$9),\"N/A\",IF(MID(Survey!$M$9,7,2)=\"14\",\"N/A\",IF(MID(Survey!$M$9,7,2)=\"16\",\"N/A\",IF(MID(Survey!$M$9,7,2)<\"14\",\"\",IF(MID(Survey!$M$9,4,3)>\"149\",\"N/A\",\"\")))))","v":"N/A"},"N/A"]
[null,{"$f":"Survey!B21","v":"3.  Is there a hail guard installed on unit?  Enter YES or NO.  NOTE: If \"CRITICAL\", unit in top ten hail states."},null,null,null,null,null,null,null,{"$f":"IF(ISBLANK(Survey!$F$9),\"N/A\",IF(MID(Survey!$M$9,7,2)=\"14\",\"N/A\",IF(MID(Survey!$M$9,7,2)=\"16\",\"N/A\",IF(MID(Survey!$M$9,7,2)<\"14\",\"\",IF(MID(Survey!$M$9,4,3)>\"149\",\"N/A\",\"\")))))","v":"N/A"},"N/A"]
[null,{"$f":"Survey!B23","v":"4.  Quantify damage/deterioration evaporator coil, and enter value 0% to 100%."},null,null,null,null,null,null,null,{"$f":"IF(ISBLANK(Survey!$F$9),\"N/A\",IF(MID(Survey!$M$9,7,2)=\"14\",\"N/A\",IF(MID(Survey!$M$9,7,2)=\"16\",\"N/A\",IF(MID(Survey!$M$9,7,2)<\"14\",\"\",IF(MID(Survey!$M$9,4,3)>\"149\",\"N/A\",\"\")))))","v":"N/A"},"N/A"]
[null,{"$f":"Survey!B25","v":"5.  Check for power exhaust at AC units greater than ten tons.  If no power exhaust, enter NO.  If there is a power exhaust enter YES"},null,null,null,null,null,null,null,{"$f":"IF(ISBLANK(Survey!$F$9),\"N/A\",IF(MID(Survey!$M$9,4,3)<=\"120\",\"N/A\",IF(MID(Survey!$M$9,7,2)=\"14\",\"N/A\",IF(MID(Survey!$M$9,7,2)=\"16\",\"N/A\",IF(MID(Survey!$M$9,7,2)<\"14\",\"\",IF(MID(Survey!$M$9,4,3)>\"149\",\"N/A\",\"\"))))))","v":"N/A"},"N/A"]
[null,{"$f":"Survey!B27","v":"6.  Are there curb adaptors on any of the units?  Enter YES or NO."},null,null,null,null,null,null,null,{"$f":"IF(ISBLANK(Survey!$F$9),\"N/A\",IF(MID(Survey!$M$9,7,2)=\"14\",\"N/A\",IF(MID(Survey!$M$9,7,2)=\"16\",\"N/A\",IF(MID(Survey!$M$9,7,2)<\"14\",\"\",IF(MID(Survey!$M$9,4,3)>\"149\",\"N/A\",\"\")))))","v":"N/A"},"N/A"]
[null,"IS THE UNIT A DEHUMIDIFICATION TYPE UNIT?  ENTER YES OR NO?"]
[null,{"$f":"Survey!B29","v":"7.  If the unit is a dehumidification type unit,  does it have the humidistat device? If so enter YES or NO."},null,null,null,null,null,null,null,{"$f":"IF(ISBLANK(Survey!$F$9),\"N/A\",IF(MID(Survey!$M$9,7,2)=\"14\",\"N/A\",IF(MID(Survey!$M$9,7,2)=\"16\",\"N/A\",IF(MID(Survey!$M$9,7,2)<\"14\",\"\",IF(MID(Survey!$M$9,4,3)>\"149\",\"N/A\",\"\")))))","v":"N/A"},"N/A"]
[null,{"$f":"Survey!B31","v":"8.  If the unit is a dehumidification type unit,  is the wiring correct from the device to the RTU Master Control Board?  If so enter YES or NO.  Lennox = Two separate shielded ComCables; Trane = One shielded two conductor ComCable."}]
[null,{"$f":"Survey!B33","v":"9.  Is a smoke detector present in unit?  If no smoked detector, enter NO.  If there is a smoke detector, enter YES."},null,null,null,null,null,null,null,{"$f":"IF(ISBLANK(Survey!$F$9),\"N/A\",\"\")","v":""}]
[null,{"$f":"Survey!B35","v":"10.  Is the smoke detector inlet sampling tube capped?  If not capped, enter NO.  If capped enter YES."},null,null,null,null,null,null,null,{"$f":"IF(ISBLANK(Survey!$F$9),\"N/A\",IF(MID($J$16,1,2)=\"NO\",\"N/A\",\"\"))","v":""},{"$f":"IF(MID($K$16,1,2)=\"NO\",\"N/A\",\"\")","v":""},null,{"$f":"IF(MID($K$16,1,2)=\"NO\",\"N/A\",\"\")","v":""}]
[null,{"$f":"Survey!B37","v":"11.  Check smoke detector module light. If light RED or an AMBER color.  If either color, enter YES, and If not enter NO."},null,null,null,null,null,null,null,{"$f":"IF(ISBLANK(Survey!$F$9),\"N/A\",IF(MID($J$16,1,2)=\"NO\",\"N/A\",\"\"))","v":""},{"$f":"IF(MID($K$16,1,2)=\"NO\",\"N/A\",\"\")","v":""},null,{"$f":"IF(MID($K$16,1,2)=\"NO\",\"N/A\",\"\")","v":""}]
[null,{"$f":"Survey!B39","v":"12.  Is smoke detector dust plugs capped?  If capped, enter YES, and if not enter NO."},null,null,null,null,null,null,null,{"$f":"IF(ISBLANK(Survey!$F$9),\"N/A\",IF(MID($J$16,1,2)=\"NO\",\"N/A\",\"\"))","v":""},{"$f":"IF(MID($K$16,1,2)=\"NO\",\"N/A\",\"\")","v":""},null,{"$f":"IF(MID($K$16,1,2)=\"NO\",\"N/A\",\"\")","v":""}]
[null,{"$f":"Survey!B41","v":"13.  Identify any damage to the blower.  If DAMAGE found, enter YES and if not enter NO.  Describe issue in Miscellaneous notes."},null,null,null,null,null,null,null,{"$f":"IF(ISBLANK(Survey!$F$9),\"N/A\",IF(MID(Survey!$M$9,7,2)=\"14\",\"N/A\",IF(MID(Survey!$M$9,7,2)=\"16\",\"N/A\",IF(MID(Survey!$M$9,7,2)<\"14\",\"\",IF(MID(Survey!$M$9,4,3)>\"149\",\"N/A\",\"\")))))","v":"N/A"},"N/A"]
[null,{"$f":"Survey!B43","v":"14.  Is blank plate secured or missing on B-cabinets?  If secured, enter YES and if not enter NO. If blank plate is missing, enter M."},null,null,null,null,null,null,null,{"$f":"IF(ISBLANK(Survey!$F$9),\"N/A\",IF(LEN(Survey!$M$9)>15,\"N/A\",IF(MID(Survey!$M$9,4,3)<=\"072\",\"N/A\",IF(MID(Survey!$M$9,4,3)>=\"180\",\"N/A\",IF(MID(Survey!$M$9,7,2)=\"14\",\"N/A\",IF(MID(Survey!$M$9,7,2)=\"16\",\"N/A\",IF(MID(Survey!$M$9,4,3)>\"149\",\"N/A\",\"\")))))))","v":"N/A"},"N/A"]
[null,{"$f":"Survey!B45","v":"15.  Is ductwork lined?  If ductwork is lined, is it intact and undamaged?  If so, enter I.  If ductwork damaged and/or deteriorating, enter D.  If ductwork is not lined, enter NO."},null,null,null,null,null,null,null,{"$f":"IF(ISBLANK(Survey!$F$9),\"N/A\",IF(MID(Survey!$M$9,7,2)=\"14\",\"N/A\",IF(MID(Survey!$M$9,7,2)=\"16\",\"N/A\",IF(MID(Survey!$M$9,7,2)<\"14\",\"\",IF(MID(Survey!$M$9,4,3)>\"149\",\"N/A\",\"\")))))","v":"N/A"},"N/A"]
[null,{"$f":"Survey!B47","v":"16. Are turning vanes present in the supply ducts of the units?  If turning vanes present enter YES and if not enter NO."},null,null,null,null,null,null,null,{"$f":"IF(ISBLANK(Survey!$F$9),\"N/A\",IF(MID(Survey!$M$9,7,2)<\"14\",\"\",IF(MID(Survey!$M$9,7,2)=\"14\",\"N/A\",IF(MID(Survey!$M$9,7,2)=\"16\",\"N/A\",IF(MID(Survey!$M$9,4,3)>\"149\",\"N/A\",\"\")))))","v":"N/A"},"N/A"]
[null,{"$f":"Survey!B49","v":"17. Are turning vanes single or double thickness?  If turning vanes double, enter D and if single enter S."},null,null,null,null,null,null,null,{"$f":"IF(ISBLANK(Survey!$F$9),\"N/A\",IF(MID(J23,1,2)=\"NO\",\"N/A\",IF(MID(Survey!$M$9,7,2)<\"14\",\"\",IF(MID(Survey!$M$9,7,2)=\"14\",\"N/A\",IF(MID(Survey!$M$9,7,2)=\"16\",\"N/A\",IF(MID(Survey!$M$9,4,3)>\"149\",\"N/A\",\"\"))))))","v":"N/A"},"N/A",null,{"$f":"IF(MID($K$23,1,2)=\"NO\",\"N/A\",\"\")","v":""}]
[null,{"$f":"Survey!B51","v":"18. Is canvas connector missing or damaged?  If no connector present, enter NO and if present enter YES.  If connector damaged enter D."},null,null,null,null,null,null,null,{"$f":"IF(ISBLANK(Survey!$F$9),\"N/A\",IF(MID(Survey!$M$9,7,2)<\"14\",\"\",IF(MID(Survey!$M$9,7,2)=\"14\",\"N/A\",IF(MID(Survey!$M$9,7,2)=\"16\",\"N/A\",IF(MID(Survey!$M$9,4,3)>\"149\",\"N/A\",\"\")))))","v":"N/A"},"N/A"]
[null,{"$f":"Survey!B53","v":"19.  If turning vanes not present, is drop radiused?  If so, does radius equal the width of the duct? If radius does not equal duct width, enter NO and if does enter YES."},null,null,null,null,null,null,null,{"$f":"IF(ISBLANK(Survey!$F$9),\"N/A\",IF(MID(J23,1,3)=\"YES\",\"N/A\",IF(MID(Survey!$M$9,7,2)<\"14\",\"\",IF(MID(Survey!$M$9,7,2)=\"14\",\"N/A\",IF(MID(Survey!$M$9,7,2)=\"16\",\"N/A\",IF(MID(Survey!$M$9,4,3)>\"149\",\"N/A\",\"\"))))))","v":"N/A"},"N/A",null,{"$f":"IF(MID($K$23,1,2)=\"NO\",\"N/A\",\"\")","v":""}]
[null,{"$f":"Survey!B55","v":"20.  Check economizer setting at Master Control Boad.  If economizer set to zero, TAB to set the economizer position to the TAB sticker setpoint or damper shaft marking (If it exists) or to 20% open should no sticker or shaft marking exists.  If economizer doesn't stroke to desired position, enter \"D\" for deficiency.  If no deficiency enter ND."},null,null,null,null,null,null,null,{"$f":"IF(ISBLANK(Survey!$F$9),\"N/A\",\"\")","v":""}]
[null,{"$f":"Survey!B57","v":"21.  Provide condensation pipe size.  Minimum 1\" at playland unit, and 1.25\" at all other units.  NOTE: DROP DOWN MENUS FOR PIPE SIZE."}]
[null,{"$f":"Survey!B59","v":"22.  Incorrect MFR of devices or equipment installed that does not match CFA specifications.  If incorrect manufacturer devices found, enter YES and decribe deficiency in miscellaneous notes.  If not enter NO."},null,null,null,null,null,null,null,{"$f":"IF(ISBLANK(Survey!$F$9),\"N/A\",IF(MID(Survey!$M$9,7,2)<\"14\",\"\",IF(MID(Survey!$M$9,7,2)=\"14\",\"N/A\",IF(MID(Survey!$M$9,7,2)=\"16\",\"N/A\",IF(MID(Survey!$M$9,4,3)>\"149\",\"N/A\",\"\")))))","v":"N/A"},"N/A"]
[null,"MISCELLENOUS NOTES"]

{"sheet":"RTU2","index":5,"n_rows":30,"n_cols":13,"rows_kept":30,"cut":false,"hidden":false,"merged":[[0,5,0,6],[18,1,18,8],[0,1,0,4],[1,1,1,4],[2,1,2,4],[3,1,3,4],[15,1,15,8],[6,1,6,8],[7,1,7,8],[8,1,8,8],[9,1,9,8],[10,1,10,8],[12,1,12,8],[26,1,26,8],[17,1,17,8],[11,1,11,8],[4,4,4,5],[20,1,20,8],[14,1,14,8],[28,1,28,8],[5,1,5,8],[16,1,16,8],[32,1,32,9],[4,1,4,3],[29,1,29,9],[22,1,22,8],[23,1,23,8],[24,1,24,8],[25,1,25,8],[19,1,19,8],[30,1,30,9],[31,1,31,9],[27,1,27,8],[21,1,21,8],[13,1,13,8]]}
[null,"RTU UNIT MANUFACTURER",null,null,null,{"$f":"Survey!AA10","v":"Lennox"}]
[null,"RTU TYPE",null,null,null,{"$f":"Survey!AI10","v":"L SERIES"}]
[null,"MODEL NUMBER",null,null,null,{"$f":"Survey!M10","v":"LGA102H2BH4Y"}]
[null,"SERIAL NUMBER",null,null,null,{"$f":"Survey!F10","v":"5609A00420"}]
[null,null,null,null,"RTU AGE",null,{"$f":"Survey!AF10","v":16.986301369863014},"RTU TONNAGE",null,{"$f":"Survey!X10","v":"8.5"}]
[null,"DESCRIPTION",null,null,null,null,null,null,null,"CODE OUTPUT","ANSWER"]
[null,{"$f":"Survey!B17","v":"1.  Using punch/screwdriver, prod heat exchanger tubes.  If holes found and/or prod test fails enter YES, lockout unit and infom management. If not, enter NO."},null,null,null,null,null,null,null,{"$f":"IF(ISBLANK(Survey!$F$10),\"N/A\",\"\")","v":""}]
[null,{"$f":"Survey!B19","v":"2.  Quantify damage/deterioration to the condenser coil, and enter value 0% to 100%."},null,null,null,null,null,null,null,{"$f":"IF(ISBLANK(Survey!$F$10),\"N/A\",IF(MID(Survey!$M$10,7,2)=\"14\",\"N/A\",IF(MID(Survey!$M$10,7,2)=\"16\",\"N/A\",IF(MID(Survey!$M$10,7,2)<\"14\",\"\",IF(MID(Survey!$M$10,4,3)>\"149\",\"N/A\",\"\")))))","v":""}]
[null,{"$f":"Survey!B21","v":"3.  Is there a hail guard installed on unit?  Enter YES or NO.  NOTE: If \"CRITICAL\", unit in top ten hail states."},null,null,null,null,null,null,null,{"$f":"IF(ISBLANK(Survey!$F$10),\"N/A\",IF(MID(Survey!$M$10,7,2)=\"14\",\"N/A\",IF(MID(Survey!$M$10,7,2)=\"16\",\"N/A\",IF(MID(Survey!$M$10,7,2)<\"14\",\"\",IF(MID(Survey!$M$10,4,3)>\"149\",\"N/A\",\"\")))))","v":""}]
[null,{"$f":"Survey!B23","v":"4.  Quantify damage/deterioration evaporator coil, and enter value 0% to 100%."},null,null,null,null,null,null,null,{"$f":"IF(ISBLANK(Survey!$F$10),\"N/A\",IF(MID(Survey!$M$10,7,2)=\"14\",\"N/A\",IF(MID(Survey!$M$10,7,2)=\"16\",\"N/A\",IF(MID(Survey!$M$10,7,2)<\"14\",\"\",IF(MID(Survey!$M$10,4,3)>\"149\",\"N/A\",\"\")))))","v":""}]
[null,{"$f":"Survey!B25","v":"5.  Check for power exhaust at AC units greater than ten tons.  If no power exhaust, enter NO.  If there is a power exhaust enter YES"},null,null,null,null,null,null,null,{"$f":"IF(ISBLANK(Survey!$F$10),\"N/A\",IF(MID(Survey!$M$10,4,3)<=\"120\",\"N/A\",IF(MID(Survey!$M$10,7,2)=\"14\",\"N/A\",IF(MID(Survey!$M$10,7,2)=\"16\",\"N/A\",IF(MID(Survey!$M$10,15,1)=\"A\",\"N/A\",IF(MID(Survey!$M$10,7,2)<\"14\",\"\",IF(MID(Survey!$M$10,4,3)>\"149\",\"N/A\",\"\")))))))","v":"N/A"},"N/A"]
[null,{"$f":"Survey!B27","v":"6.  Are there curb adaptors on any of the units?  Enter YES or NO."},null,null,null,null,null,null,null,{"$f":"IF(ISBLANK(Survey!$F$10),\"N/A\",IF(MID(Survey!$M$10,7,2)=\"14\",\"N/A\",IF(MID(Survey!$M$10,7,2)=\"16\",\"N/A\",IF(MID(Survey!$M$10,7,2)<\"14\",\"\",IF(MID(Survey!$M$10,4,3)>\"149\",\"N/A\",\"\")))))","v":""}]
[null,"IS THE UNIT A DEHUMIDIFICATION TYPE UNIT?  ENTER YES OR NO?"]
[null,{"$f":"Survey!B29","v":"7.  If the unit is a dehumidification type unit,  does it have the humidistat device? If so enter YES or NO."},null,null,null,null,null,null,null,{"$f":"IF(ISBLANK(Survey!$F$10),\"N/A\",\"\")","v":""}]
[null,{"$f":"Survey!B31","v":"8.  If the unit is a dehumidification type unit,  is the wiring correct from the device to the RTU Master Control Board?  If so enter YES or NO.  Lennox = Two separate shielded ComCables; Trane = One shielded two conductor ComCable."}]
[null,{"$f":"Survey!B33","v":"9.  Is a smoke detector present in unit?  If no smoked detector, enter NO.  If there is a smoke detector, enter YES."},null,null,null,null,null,null,null,{"$f":"IF(ISBLANK(Survey!$F$10),\"N/A\",\"\")","v":""}]
[null,{"$f":"Survey!B35","v":"10.  Is the smoke detector inlet sampling tube capped?  If not capped, enter NO.  If capped enter YES."},null,null,null,null,null,null,null,{"$f":"IF(ISBLANK(Survey!$F$10),\"N/A\",IF(MID($J$16,1,2)=\"NO\",\"N/A\",\"\"))","v":""},{"$f":"IF(MID($K$16,1,2)=\"NO\",\"N/A\",\"\")","v":""},null,{"$f":"IF(MID($K$16,1,2)=\"NO\",\"N/A\",\"\")","v":""}]
[null,{"$f":"Survey!B37","v":"11.  Check smoke detector module light. If light RED or an AMBER color.  If either color, enter YES, and If not enter NO."},null,null,null,null,null,null,null,{"$f":"IF(ISBLANK(Survey!$F$10),\"N/A\",IF(MID($J$16,1,2)=\"NO\",\"N/A\",\"\"))","v":""},{"$f":"IF(MID($K$16,1,2)=\"NO\",\"N/A\",\"\")","v":""},null,{"$f":"IF(MID($K$16,1,2)=\"NO\",\"N/A\",\"\")","v":""}]
[null,{"$f":"Survey!B39","v":"12.  Is smoke detector dust plugs capped?  If capped, enter YES, and if not enter NO."},null,null,null,null,null,null,null,{"$f":"IF(ISBLANK(Survey!$F$10),\"N/A\",IF(MID($J$16,1,2)=\"NO\",\"N/A\",\"\"))","v":""},{"$f":"IF(MID($K$16,1,2)=\"NO\",\"N/A\",\"\")","v":""},null,{"$f":"IF(MID($K$16,1,2)=\"NO\",\"N/A\",\"\")","v":""}]
[null,{"$f":"Survey!B41","v":"13.  Identify any damage to the blower.  If DAMAGE found, enter YES and if not enter NO.  Describe issue in Miscellaneous notes."},null,null,null,null,null,null,null,{"$f":"IF(ISBLANK(Survey!$F$10),\"N/A\",IF(MID(Survey!$M$10,7,2)=\"14\",\"N/A\",IF(MID(Survey!$M$10,7,2)=\"16\",\"N/A\",IF(MID(Survey!$M$10,7,2)<\"14\",\"\",IF(MID(Survey!$M$10,4,3)>\"149\",\"N/A\",\"\")))))","v":""}]
[null,{"$f":"Survey!B43","v":"14.  Is blank plate secured or missing on B-cabinets?  If secured, enter YES and if not enter NO. If blank plate is missing, enter M."},null,null,null,null,null,null,null,{"$f":"IF(ISBLANK(Survey!$F$10),\"N/A\",IF(LEN(Survey!$M$10)>15,\"N/A\",IF(MID(Survey!$M$10,4,3)<=\"072\",\"N/A\",IF(MID(Survey!$M$10,4,3)>=\"180\",\"N/A\",IF(MID(Survey!$M$10,7,2)=\"14\",\"N/A\",IF(MID(Survey!$M$10,7,2)=\"16\",\"N/A\",IF(MID(Survey!$M$10,4,3)>\"149\",\"N/A\",\"\")))))))","v":""},"N/A"]
[null,{"$f":"Survey!B45","v":"15.  Is ductwork lined?  If ductwork is lined, is it intact and undamaged?  If so, enter I.  If ductwork damaged and/or deteriorating, enter D.  If ductwork is not lined, enter NO."},null,null,null,null,null,null,null,{"$f":"IF(ISBLANK(Survey!$F$10),\"N/A\",IF(MID(Survey!$M$10,7,2)<\"14\",\"\",IF(MID(Survey!$M$10,7,2)=\"14\",\"N/A\",IF(MID(Survey!$M$10,7,2)=\"16\",\"N/A\",IF(MID(Survey!$M$10,4,3)>\"149\",\"N/A\",\"\")))))","v":""}]
[null,{"$f":"Survey!B47","v":"16. Are turning vanes present in the supply ducts of the units?  If turning vanes present enter YES and if not enter NO."},null,null,null,null,null,null,null,{"$f":"IF(ISBLANK(Survey!$F$10),\"N/A\",IF(MID(Survey!$M$10,7,2)<\"14\",\"\",IF(MID(Survey!$M$10,7,2)=\"14\",\"N/A\",IF(MID(Survey!$M$10,7,2)=\"16\",\"N/A\",IF(MID(Survey!$M$10,4,3)>\"149\",\"N/A\",\"\")))))","v":""}]
[null,{"$f":"Survey!B49","v":"17. Are turning vanes single or double thickness?  If turning vanes double, enter D and if single enter S."},null,null,null,null,null,null,null,{"$f":"IF(ISBLANK(Survey!$F$10),\"N/A\",IF(MID(J23,1,2)=\"NO\",\"N/A\",IF(MID(Survey!$M$10,7,2)<\"14\",\"\",IF(MID(Survey!$M$10,7,2)=\"14\",\"N/A\",IF(MID(Survey!$M$10,7,2)=\"16\",\"N/A\",IF(MID(Survey!$M$10,4,3)>\"149\",\"N/A\",\"\"))))))","v":""},{"$f":"IF(MID($K$23,1,2)=\"NO\",\"N/A\",\"\")","v":""},null,{"$f":"IF(MID($K$23,1,2)=\"NO\",\"N/A\",\"\")","v":""}]
[null,{"$f":"Survey!B51","v":"18. Is canvas connector missing or damaged?  If no connector present, enter NO and if present enter YES.  If connector damaged enter D."},null,null,null,null,null,null,null,{"$f":"IF(ISBLANK(Survey!$F$10),\"N/A\",IF(MID(Survey!$M$10,7,2)<\"14\",\"\",IF(MID(Survey!$M$10,7,2)=\"14\",\"N/A\",IF(MID(Survey!$M10,7,2)=\"16\",\"N/A\",IF(MID(Survey!$M$10,4,3)>\"149\",\"N/A\",\"\")))))","v":""}]
[null,{"$f":"Survey!B53","v":"19.  If turning vanes not present, is drop radiused?  If so, does radius equal the width of the duct? If radius does not equal duct width, enter NO and if does enter YES."},null,null,null,null,null,null,null,{"$f":"IF(ISBLANK(Survey!$F$10),\"N/A\",IF(MID(J23,1,3)=\"YES\",\"N/A\",IF(MID(Survey!$M$10,7,2)<\"14\",\"\",IF(MID(Survey!$M$10,7,2)=\"14\",\"N/A\",IF(MID(Survey!$M$10,7,2)=\"16\",\"N/A\",IF(MID(Survey!$M$10,4,3)>\"149\",\"N/A\",\"\"))))))","v":""},{"$f":"IF(MID($K$23,1,3)=\"YES\",\"N/A\",\"\")","v":""},null,{"$f":"IF(MID($K$23,1,3)=\"YES\",\"N/A\",\"\")","v":""}]
[null,{"$f":"Survey!B55","v":"20.  Check economizer setting at Master Control Boad.  If economizer set to zero, TAB to set the economizer position to the TAB sticker setpoint or damper shaft marking (If it exists) or to 20% open should no sticker or shaft marking exists.  If economizer doesn't stroke to desired position, enter \"D\" for deficiency.  If no deficiency enter ND."},null,null,null,null,null,null,null,{"$f":"IF(ISBLANK(Survey!$F$10),\"N/A\",\"\")","v":""}]
[null,{"$f":"Survey!B57","v":"21.  Provide condensation pipe size.  Minimum 1\" at playland unit, and 1.25\" at all other units.  NOTE: DROP DOWN MENUS FOR PIPE SIZE."}]
[null,{"$f":"Survey!B59","v":"22.  Incorrect MFR of devices or equipment installed that does not match CFA specifications.  If incorrect manufacturer devices found, enter YES and decribe deficiency in miscellaneous notes.  If not enter NO."},null,null,null,null,null,null,null,{"$f":"IF(ISBLANK(Survey!$F$10),\"N/A\",IF(MID(Survey!$M$10,7,2)<\"14\",\"\",IF(MID(Survey!$M$10,7,2)=\"14\",\"N/A\",IF(MID(Survey!$M$10,7,2)=\"16\",\"N/A\",IF(MID(Survey!$M$10,4,3)>\"149\",\"N/A\",\"\")))))","v":""}]
[null,"MISCELLENOUS NOTES"]

{"sheet":"RTU3","index":6,"n_rows":30,"n_cols":13,"rows_kept":30,"cut":false,"hidden":false,"merged":[[32,1,32,10],[29,1,29,10],[30,1,30,10],[31,1,31,10],[14,1,14,8],[27,1,27,8],[25,1,25,8],[28,1,28,8],[24,1,24,8],[26,1,26,8],[17,1,17,8],[18,1,18,8],[19,1,19,8],[20,1,20,8],[21,1,21,8],[23,1,23,8],[0,1,0,4],[0,5,0,6],[1,1,1,4],[2,1,2,4],[3,1,3,4],[15,1,15,8],[16,1,16,8],[22,1,22,8],[4,4,4,5],[13,1,13,8],[6,1,6,8],[7,1,7,8],[8,1,8,8],[9,1,9,8],[10,1,10,8],[5,1,5,8],[11,1,11,8],[12,1,12,8]]}
[null,"RTU UNIT MANUFACTURER",null,null,null,{"$f":"Survey!AA11","v":"Lennox"}]
[null,"RTU TYPE",null,null,null,{"$f":"Survey!AI11","v":"ENERGENCE"}]
[null,"MODEL NUMBER",null,null,null,{"$f":"Survey!M11","v":"LGH150H4BH2Y"}]
[null,"SERIAL NUMBER",null,null,null,{"$f":"Survey!F11","v":"5622H07235"}]
[null,null,null,null,"RTU AGE",null,{"$f":"Survey!AF11","v":3.3972602739726026},"RTU TONNAGE",null,{"$f":"Survey!X11","v":"12.5"}]
[null,"DESCRIPTION",null,null,null,null,null,null,null,"CODE OUTPUT","ANSWER"]
[null,{"$f":"Survey!B17","v":"1.  Using punch/screwdriver, prod heat exchanger tubes.  If holes found and/or prod test fails enter YES, lockout unit and infom management. If not, enter NO."},null,null,null,null,null,null,null,{"$f":"IF(ISBLANK(Survey!$F$11),\"N/A\",\"\")","v":""}]
[null,{"$f":"Survey!B19","v":"2.  Quantify damage/deterioration to the condenser coil, and enter value 0% to 100%."},null,null,null,null,null,null,null,{"$f":"IF(ISBLANK(Survey!$F$11),\"N/A\",\"\")","v":""}]
[null,{"$f":"Survey!B21","v":"3.  Is there a hail guard installed on unit?  Enter YES or NO.  NOTE: If \"CRITICAL\", unit in top ten hail states."},null,null,null,null,null,null,null,{"$f":"IF(ISBLANK(Survey!$F$11),\"N/A\",\"\")","v":""}]
[null,{"$f":"Survey!B23","v":"4.  Quantify damage/deterioration evaporator coil, and enter value 0% to 100%."},null,null,null,null,null,null,null,{"$f":"IF(ISBLANK(Survey!$F$11),\"N/A\",\"\")","v":""}]
[null,{"$f":"Survey!B25","v":"5.  Check for power exhaust at AC units greater than ten tons.  If no power exhaust, enter NO.  If there is a power exhaust enter YES"},null,null,null,null,null,null,null,{"$f":"IF(ISBLANK(Survey!$F$11),\"N/A\",IF(MID(Survey!$M$11,15,1)=\"A\",\"N/A\",IF(MID(Survey!$M$11,4,3)<=\"120\",\"N/A\",\"\")))","v":""}]
[null,{"$f":"Survey!B27","v":"6.  Are there curb adaptors on any of the units?  Enter YES or NO."},null,null,null,null,null,null,null,{"$f":"IF(ISBLANK(Survey!$F$11),\"N/A\",\"\")","v":""}]
[null,"IS THE UNIT A DEHUMIDIFICATION TYPE UNIT?  ENTER YES OR NO?"]
[null,{"$f":"Survey!B29","v":"7.  If the unit is a dehumidification type unit,  does it have the humidistat device? If so enter YES or NO."},null,null,null,null,null,null,null,{"$f":"IF(ISBLANK(Survey!$F$11),\"N/A\",\"\")","v":""}]
[null,{"$f":"Survey!B31","v":"8.  If the unit is a dehumidification type unit,  is the wiring correct from the device to the RTU Master Control Board?  If so enter YES or NO.  Lennox = Two separate shielded ComCables; Trane = One shielded two conductor ComCable."}]
[null,{"$f":"Survey!B33","v":"9.  Is a smoke detector present in unit?  If no smoked detector, enter NO.  If there is a smoke detector, enter YES."},null,null,null,null,null,null,null,{"$f":"IF(ISBLANK(Survey!$F$11),\"N/A\",\"\")","v":""}]
[null,{"$f":"Survey!B35","v":"10.  Is the smoke detector inlet sampling tube capped?  If not capped, enter NO.  If capped enter YES."},null,null,null,null,null,null,null,{"$f":"IF(ISBLANK(Survey!$F$11),\"N/A\",IF(MID($J$16,1,2)=\"NO\",\"N/A\",\"\"))","v":""},{"$f":"IF(MID($K$16,1,2)=\"NO\",\"N/A\",\"\")","v":""},null,{"$f":"IF(MID($K$16,1,2)=\"NO\",\"N/A\",\"\")","v":""}]
[null,{"$f":"Survey!B37","v":"11.  Check smoke detector module light. If light RED or an AMBER color.  If either color, enter YES, and If not enter NO."},null,null,null,null,null,null,null,{"$f":"IF(ISBLANK(Survey!$F$11),\"N/A\",IF(MID($J$16,1,2)=\"NO\",\"N/A\",\"\"))","v":""},{"$f":"IF(MID($K$16,1,2)=\"NO\",\"N/A\",\"\")","v":""},null,{"$f":"IF(MID($K$16,1,2)=\"NO\",\"N/A\",\"\")","v":""}]
[null,{"$f":"Survey!B39","v":"12.  Is smoke detector dust plugs capped?  If capped, enter YES, and if not enter NO."},null,null,null,null,null,null,null,{"$f":"IF(ISBLANK(Survey!$F$11),\"N/A\",IF(MID($J$16,1,2)=\"NO\",\"N/A\",\"\"))","v":""},{"$f":"IF(MID($K$16,1,2)=\"NO\",\"N/A\",\"\")","v":""},null,{"$f":"IF(MID($K$16,1,2)=\"NO\",\"N/A\",\"\")","v":""}]
[null,{"$f":"Survey!B41","v":"13.  Identify any damage to the blower.  If DAMAGE found, enter YES and if not enter NO.  Describe issue in Miscellaneous notes."},null,null,null,null,null,null,null,{"$f":"IF(ISBLANK(Survey!$F$11),\"N/A\",\"\")","v":""}]
[null,{"$f":"Survey!B43","v":"14.  Is blank plate secured or missing on B-cabinets?  If secured, enter YES and if not enter NO. If blank plate is missing, enter M."},null,null,null,null,null,null,null,{"$f":"IF(ISBLANK(Survey!$F$11),\"N/A\",IF(LEN(Survey!$M$11)>15,\"N/A\",IF(MID(Survey!$M$11,4,3)<=\"072\",\"N/A\",IF(MID(Survey!$M$11,4,3)>=\"180\",\"N/A\",\"\"))))","v":""}]
[null,{"$f":"Survey!B45","v":"15.  Is ductwork lined?  If ductwork is lined, is it intact and undamaged?  If so, enter I.  If ductwork damaged and/or deteriorating, enter D.  If ductwork is not lined, enter NO."},null,null,null,null,null,null,null,{"$f":"IF(ISBLANK(Survey!$F$11),\"N/A\",\"\")","v":""}]
[null,{"$f":"Survey!B47","v":"16. Are turning vanes present in the supply ducts of the units?  If turning vanes present enter YES and if not enter NO."},null,null,null,null,null,null,null,{"$f":"IF(ISBLANK(Survey!$F$11),\"N/A\",\"\")","v":""}]
[null,{"$f":"Survey!B49","v":"17. Are turning vanes single or double thickness?  If turning vanes double, enter D and if single enter S."},null,null,null,null,null,null,null,{"$f":"IF(ISBLANK(Survey!$F$11),\"N/A\",IF(MID(J23,1,2)=\"NO\",\"N/A\",\"\"))","v":""},{"$f":"IF(MID($K$23,1,2)=\"NO\",\"N/A\",\"\")","v":""},null,{"$f":"IF(MID($K$23,1,2)=\"NO\",\"N/A\",\"\")","v":""}]
[null,{"$f":"Survey!B51","v":"18. Is canvas connector missing or damaged?  If no connector present, enter NO and if present enter YES.  If connector damaged enter D."},null,null,null,null,null,null,null,{"$f":"IF(ISBLANK(Survey!$F$11),\"N/A\",\"\")","v":""}]
[null,{"$f":"Survey!B53","v":"19.  If turning vanes not present, is drop radiused?  If so, does radius equal the width of the duct? If radius does not equal duct width, enter NO and if does enter YES."},null,null,null,null,null,null,null,{"$f":"IF(ISBLANK(Survey!$F$11),\"N/A\",IF(MID(J23,1,3)=\"YES\",\"N/A\",\"\"))","v":""},{"$f":"IF(MID($K$23,1,3)=\"YES\",\"N/A\",\"\")","v":""},null,{"$f":"IF(MID($K$23,1,3)=\"YES\",\"N/A\",\"\")","v":""}]
[null,{"$f":"Survey!B55","v":"20.  Check economizer setting at Master Control Boad.  If economizer set to zero, TAB to set the economizer position to the TAB sticker setpoint or damper shaft marking (If it exists) or to 20% open should no sticker or shaft marking exists.  If economizer doesn't stroke to desired position, enter \"D\" for deficiency.  If no deficiency enter ND."},null,null,null,null,null,null,null,{"$f":"IF(ISBLANK(Survey!$F$11),\"N/A\",\"\")","v":""}]
[null,{"$f":"Survey!B57","v":"21.  Provide condensation pipe size.  Minimum 1\" at playland unit, and 1.25\" at all other units.  NOTE: DROP DOWN MENUS FOR PIPE SIZE."}]
[null,{"$f":"Survey!B59","v":"22.  Incorrect MFR of devices or equipment installed that does not match CFA specifications.  If incorrect manufacturer devices found, enter YES and decribe deficiency in miscellaneous notes.  If not enter NO."},null,null,null,null,null,null,null,{"$f":"IF(ISBLANK(Survey!$F$11),\"N/A\",\"\")","v":""}]
[null,"MISCELLENOUS NOTES"]

{"sheet":"RTU4","index":7,"n_rows":30,"n_cols":13,"rows_kept":30,"cut":false,"hidden":false,"merged":[[32,1,32,10],[30,1,30,10],[31,1,31,10],[24,1,24,8],[27,1,27,8],[25,1,25,8],[26,1,26,8],[28,1,28,8],[20,1,20,8],[21,1,21,8],[22,1,22,8],[23,1,23,8],[29,1,29,10],[15,1,15,8],[16,1,16,8],[17,1,17,8],[18,1,18,8],[19,1,19,8],[14,1,14,8],[13,1,13,8],[11,1,11,8],[0,1,0,4],[0,5,0,6],[1,1,1,4],[2,1,2,4],[3,1,3,4],[6,1,6,8],[7,1,7,8],[8,1,8,8],[9,1,9,8],[10,1,10,8],[4,4,4,5],[5,1,5,8],[12,1,12,8]]}
[null,"RTU UNIT MANUFACTURER",null,null,null,{"$f":"Survey!AA12","v":"Lennox"}]
[null,"RTU TYPE",null,null,null,{"$f":"Survey!AI12","v":"L SERIES"}]
[null,"MODEL NUMBER",null,null,null,{"$f":"Survey!M12","v":"LGH060"}]
[null,"SERIAL NUMBER",null,null,null,{"$f":"Survey!F12","v":"5609A "}]
[null,null,null,null,"RTU AGE",null,{"$f":"Survey!AF12","v":126.06575342465753},"RTU TONNAGE",null,{"$f":"Survey!X12","v":"5"}]
[null,"DESCRIPTION",null,null,null,null,null,null,null,"CODE OUTPUT","ANSWER"]
[null,{"$f":"Survey!B17","v":"1.  Using punch/screwdriver, prod heat exchanger tubes.  If holes found and/or prod test fails enter YES, lockout unit and infom management. If not, enter NO."},null,null,null,null,null,null,null,{"$f":"IF(ISBLANK(Survey!$F$12),\"N/A\",\"\")","v":""}]
[null,{"$f":"Survey!B19","v":"2.  Quantify damage/deterioration to the condenser coil, and enter value 0% to 100%."},null,null,null,null,null,null,null,{"$f":"IF(ISBLANK(Survey!$F$12),\"N/A\",IF(MID(Survey!$M$12,7,2)=\"14\",\"N/A\",IF(MID(Survey!$M$12,7,2)=\"16\",\"N/A\",IF(MID(Survey!$M$12,7,2)<\"14\",\"\",IF(MID(Survey!$M$12,4,3)>\"149\",\"N/A\",\"\")))))","v":""}]
[null,{"$f":"Survey!B21","v":"3.  Is there a hail guard installed on unit?  Enter YES or NO.  NOTE: If \"CRITICAL\", unit in top ten hail states."},null,null,null,null,null,null,null,{"$f":"IF(ISBLANK(Survey!$F$12),\"N/A\",\"\")","v":""}]
[null,{"$f":"Survey!B23","v":"4.  Quantify damage/deterioration evaporator coil, and enter value 0% to 100%."},null,null,null,null,null,null,null,{"$f":"IF(ISBLANK(Survey!$F$12),\"N/A\",\"\")","v":""}]
[null,{"$f":"Survey!B25","v":"5.  Check for power exhaust at AC units greater than ten tons.  If no power exhaust, enter NO.  If there is a power exhaust enter YES"},null,null,null,null,null,null,null,{"$f":"IF(ISBLANK(Survey!$F$12),\"N/A\",IF(MID(Survey!$M$12,15,1)=\"A\",\"N/A\",IF(MID(Survey!$M$12,4,3)<=\"120\",\"N/A\",)))","v":"N/A"},"N/A"]
[null,{"$f":"Survey!B27","v":"6.  Are there curb adaptors on any of the units?  Enter YES or NO."},null,null,null,null,null,null,null,{"$f":"IF(ISBLANK(Survey!$F$12),\"N/A\",\"\")","v":""}]
[null,"IS THE UNIT A DEHUMIDIFICATION TYPE UNIT?  ENTER YES OR NO?"]
[null,{"$f":"Survey!B29","v":"7.  If the unit is a dehumidification type unit,  does it have the humidistat device? If so enter YES or NO."},null,null,null,null,null,null,null,{"$f":"IF(ISBLANK(Survey!$F$12),\"N/A\",\"\")","v":""}]
[null,{"$f":"Survey!B31","v":"8.  If the unit is a dehumidification type unit,  is the wiring correct from the device to the RTU Master Control Board?  If so enter YES or NO.  Lennox = Two separate shielded ComCables; Trane = One shielded two conductor ComCable."}]
[null,{"$f":"Survey!B33","v":"9.  Is a smoke detector present in unit?  If no smoked detector, enter NO.  If there is a smoke detector, enter YES."},null,null,null,null,null,null,null,{"$f":"IF(ISBLANK(Survey!$F$12),\"N/A\",\"\")","v":""}]
[null,{"$f":"Survey!B35","v":"10.  Is the smoke detector inlet sampling tube capped?  If not capped, enter NO.  If capped enter YES."},null,null,null,null,null,null,null,{"$f":"IF(ISBLANK(Survey!$F$12),\"N/A\",IF(MID($J$16,1,2)=\"NO\",\"N/A\",\"\"))","v":""},{"$f":"IF(MID($K$16,1,2)=\"NO\",\"N/A\",\"\")","v":""},null,{"$f":"IF(MID($K$16,1,2)=\"NO\",\"N/A\",\"\")","v":""}]
[null,{"$f":"Survey!B37","v":"11.  Check smoke detector module light. If light RED or an AMBER color.  If either color, enter YES, and If not enter NO."},null,null,null,null,null,null,null,{"$f":"IF(ISBLANK(Survey!$F$12),\"N/A\",IF(MID($J$16,1,2)=\"NO\",\"N/A\",\"\"))","v":""},{"$f":"IF(MID($K$16,1,2)=\"NO\",\"N/A\",\"\")","v":""},null,{"$f":"IF(MID($K$16,1,2)=\"NO\",\"N/A\",\"\")","v":""}]
[null,{"$f":"Survey!B39","v":"12.  Is smoke detector dust plugs capped?  If capped, enter YES, and if not enter NO."},null,null,null,null,null,null,null,{"$f":"IF(ISBLANK(Survey!$F$12),\"N/A\",IF(MID($J$16,1,2)=\"NO\",\"N/A\",\"\"))","v":""},{"$f":"IF(MID($K$16,1,2)=\"NO\",\"N/A\",\"\")","v":""},null,{"$f":"IF(MID($K$16,1,2)=\"NO\",\"N/A\",\"\")","v":""}]
[null,{"$f":"Survey!B41","v":"13.  Identify any damage to the blower.  If DAMAGE found, enter YES and if not enter NO.  Describe issue in Miscellaneous notes."},null,null,null,null,null,null,null,{"$f":"IF(ISBLANK(Survey!$F$12),\"N/A\",\"\")","v":""}]
[null,{"$f":"Survey!B43","v":"14.  Is blank plate secured or missing on B-cabinets?  If secured, enter YES and if not enter NO. If blank plate is missing, enter M."},null,null,null,null,null,null,null,{"$f":"IF(ISBLANK(Survey!$F$12),\"N/A\",IF(LEN(Survey!$M$12)>15,\"N/A\",IF(MID(Survey!$M$12,4,3)<=\"072\",\"N/A\",IF(MID(Survey!$M$12,4,3)>=\"180\",\"N/A\",\"\"))))","v":"N/A"},"N/A"]
[null,{"$f":"Survey!B45","v":"15.  Is ductwork lined?  If ductwork is lined, is it intact and undamaged?  If so, enter I.  If ductwork damaged and/or deteriorating, enter D.  If ductwork is not lined, enter NO."},null,null,null,null,null,null,null,{"$f":"IF(ISBLANK(Survey!$F$12),\"N/A\",\"\")","v":""}]
[null,{"$f":"Survey!B47","v":"16. Are turning vanes present in the supply ducts of the units?  If turning vanes present enter YES and if not enter NO."},null,null,null,null,null,null,null,{"$f":"IF(ISBLANK(Survey!$F$12),\"N/A\",\"\")","v":""}]
[null,{"$f":"Survey!B49","v":"17. Are turning vanes single or double thickness?  If turning vanes double, enter D and if single enter S."},null,null,null,null,null,null,null,{"$f":"IF(ISBLANK(Survey!$F$12),\"N/A\",IF(MID(J23,1,2)=\"NO\",\"N/A\",\"\"))","v":""},{"$f":"IF(MID($K$23,1,2)=\"NO\",\"N/A\",\"\")","v":""},null,{"$f":"IF(MID($K$23,1,2)=\"NO\",\"N/A\",\"\")","v":""}]
[null,{"$f":"Survey!B51","v":"18. Is canvas connector missing or damaged?  If no connector present, enter NO and if present enter YES.  If connector damaged enter D."},null,null,null,null,null,null,null,{"$f":"IF(ISBLANK(Survey!$F$12),\"N/A\",\"\")","v":""}]
[null,{"$f":"Survey!B53","v":"19.  If turning vanes not present, is drop radiused?  If so, does radius equal the width of the duct? If radius does not equal duct width, enter NO and if does enter YES."},null,null,null,null,null,null,null,{"$f":"IF(ISBLANK(Survey!$F$12),\"N/A\",IF(MID(J23,1,3)=\"YES\",\"N/A\",\"\"))","v":""},{"$f":"IF(MID($K$23,1,3)=\"YES\",\"N/A\",\"\")","v":""},null,{"$f":"IF(MID($K$23,1,3)=\"YES\",\"N/A\",\"\")","v":""}]
[null,{"$f":"Survey!B55","v":"20.  Check economizer setting at Master Control Boad.  If economizer set to zero, TAB to set the economizer position to the TAB sticker setpoint or damper shaft marking (If it exists) or to 20% open should no sticker or shaft marking exists.  If economizer doesn't stroke to desired position, enter \"D\" for deficiency.  If no deficiency enter ND."},null,null,null,null,null,null,null,{"$f":"IF(ISBLANK(Survey!$F$12),\"N/A\",\"\")","v":""}]
[null,{"$f":"Survey!B57","v":"21.  Provide condensation pipe size.  Minimum 1\" at playland unit, and 1.25\" at all other units.  NOTE: DROP DOWN MENUS FOR PIPE SIZE."}]
[null,{"$f":"Survey!B59","v":"22.  Incorrect MFR of devices or equipment installed that does not match CFA specifications.  If incorrect manufacturer devices found, enter YES and decribe deficiency in miscellaneous notes.  If not enter NO."},null,null,null,null,null,null,null,{"$f":"IF(ISBLANK(Survey!$F$12),\"N/A\",\"\")","v":""}]
[null,"MISCELLENOUS NOTES"]

{"sheet":"RTU5","index":8,"n_rows":30,"n_cols":13,"rows_kept":30,"cut":false,"hidden":false,"merged":[[11,1,11,8],[0,1,0,4],[0,5,0,6],[1,1,1,4],[2,1,2,4],[3,1,3,4],[6,1,6,8],[7,1,7,8],[8,1,8,8],[9,1,9,8],[10,1,10,8],[4,4,4,5],[4,1,4,3],[19,1,19,8],[13,1,13,8],[15,1,15,8],[16,1,16,8],[17,1,17,8],[18,1,18,8],[12,1,12,8],[30,1,30,10],[31,1,31,10],[32,1,32,10],[5,1,5,8],[29,1,29,10],[14,1,14,8],[27,1,27,8],[26,1,26,8],[24,1,24,8],[25,1,25,8],[28,1,28,8],[20,1,20,8],[21,1,21,8],[22,1,22,8],[23,1,23,8]]}
[null,"RTU UNIT MANUFACTURER",null,null,null,{"$f":"Survey!AA13","v":""}]
[null,"RTU TYPE",null,null,null,{"$f":"Survey!AI13","v":""}]
[null,"MODEL NUMBER",null,null,null,{"$f":"Survey!M13","v":0}]
[null,"SERIAL NUMBER",null,null,null,{"$f":"Survey!F13","v":0}]
[null,null,null,null,"RTU AGE",null,{"$f":"Survey!AF13","v":0},"RTU TONNAGE",null,{"$f":"Survey!X13","v":""}]
[null,"DESCRIPTION",null,null,null,null,null,null,null,"CODE OUTPUT","ANSWER"]
[null,{"$f":"Survey!B17","v":"1.  Using punch/screwdriver, prod heat exchanger tubes.  If holes found and/or prod test fails enter YES, lockout unit and infom management. If not, enter NO."},null,null,null,null,null,null,null,{"$f":"IF(ISBLANK(Survey!$F$13),\"N/A\",\"\")","v":""}]
[null,{"$f":"Survey!B19","v":"2.  Quantify damage/deterioration to the condenser coil, and enter value 0% to 100%."},null,null,null,null,null,null,null,{"$f":"IF(ISBLANK(Survey!$F$13),\"N/A\",IF(MID(Survey!$M$13,7,2)=\"14\",\"N/A\",IF(MID(Survey!$M$13,7,2)=\"16\",\"N/A\",IF(MID(Survey!$M$13,7,2)<\"14\",\"\",IF(MID(Survey!$M$13,4,3)>\"149\",\"N/A\",\"\")))))","v":""}]
[null,{"$f":"Survey!B21","v":"3.  Is there a hail guard installed on unit?  Enter YES or NO.  NOTE: If \"CRITICAL\", unit in top ten hail states."},null,null,null,null,null,null,null,{"$f":"IF(ISBLANK(Survey!$F$13),\"N/A\",\"\")","v":""}]
[null,{"$f":"Survey!B23","v":"4.  Quantify damage/deterioration evaporator coil, and enter value 0% to 100%."},null,null,null,null,null,null,null,{"$f":"IF(ISBLANK(Survey!$F$13),\"N/A\",\"\")","v":""}]
[null,{"$f":"Survey!B25","v":"5.  Check for power exhaust at AC units greater than ten tons.  If no power exhaust, enter NO.  If there is a power exhaust enter YES"},null,null,null,null,null,null,null,{"$f":"IF(ISBLANK(Survey!$F$13),\"N/A\",IF(MID($M$14,4,3)<=\"120\",\"N/A\",))","v":"N/A"}]
[null,{"$f":"Survey!B27","v":"6.  Are there curb adaptors on any of the units?  Enter YES or NO."},null,null,null,null,null,null,null,{"$f":"IF(ISBLANK(Survey!$F$13),\"N/A\",\"\")","v":""}]
[null,"IS THE UNIT A DEHUMIDIFICATION TYPE UNIT?  ENTER YES OR NO?"]
[null,{"$f":"Survey!B29","v":"7.  If the unit is a dehumidification type unit,  does it have the humidistat device? If so enter YES or NO."},null,null,null,null,null,null,null,{"$f":"IF(ISBLANK(Survey!$F$13),\"N/A\",\"\")","v":""},{"$f":"IF(K13=\"NO\",\"N/A\",\"\")","v":""}]
[null,{"$f":"Survey!B31","v":"8.  If the unit is a dehumidification type unit,  is the wiring correct from the device to the RTU Master Control Board?  If so enter YES or NO.  Lennox = Two separate shielded ComCables; Trane = One shielded two conductor ComCable."},null,null,null,null,null,null,null,null,{"$f":"IF(K13=\"NO\",\"N/A\",\"\")","v":""}]
[null,{"$f":"Survey!B33","v":"9.  Is a smoke detector present in unit?  If no smoked detector, enter NO.  If there is a smoke detector, enter YES."},null,null,null,null,null,null,null,{"$f":"IF(ISBLANK(Survey!$F$13),\"N/A\",\"\")","v":""}]
[null,{"$f":"Survey!B35","v":"10.  Is the smoke detector inlet sampling tube capped?  If not capped, enter NO.  If capped enter YES."},null,null,null,null,null,null,null,{"$f":"IF(ISBLANK(Survey!$F$13),\"N/A\",IF(MID($J$16,1,2)=\"NO\",\"N/A\",\"\"))","v":""},{"$f":"IF(MID($K$16,1,2)=\"NO\",\"N/A\",\"\")","v":""},null,{"$f":"IF(MID($K$16,1,2)=\"NO\",\"N/A\",\"\")","v":""}]
[null,{"$f":"Survey!B37","v":"11.  Check smoke detector module light. If light RED or an AMBER color.  If either color, enter YES, and If not enter NO."},null,null,null,null,null,null,null,{"$f":"IF(ISBLANK(Survey!$F$13),\"N/A\",IF(MID($J$16,1,2)=\"NO\",\"N/A\",\"\"))","v":""},{"$f":"IF(MID($K$16,1,2)=\"NO\",\"N/A\",\"\")","v":""},null,{"$f":"IF(MID($K$16,1,2)=\"NO\",\"N/A\",\"\")","v":""}]
[null,{"$f":"Survey!B39","v":"12.  Is smoke detector dust plugs capped?  If capped, enter YES, and if not enter NO."},null,null,null,null,null,null,null,{"$f":"IF(ISBLANK(Survey!$F$13),\"N/A\",IF(MID($J$16,1,2)=\"NO\",\"N/A\",\"\"))","v":""},{"$f":"IF(MID($K$16,1,2)=\"NO\",\"N/A\",\"\")","v":""},null,{"$f":"IF(MID($K$16,1,2)=\"NO\",\"N/A\",\"\")","v":""}]
[null,{"$f":"Survey!B41","v":"13.  Identify any damage to the blower.  If DAMAGE found, enter YES and if not enter NO.  Describe issue in Miscellaneous notes."},null,null,null,null,null,null,null,{"$f":"IF(ISBLANK(Survey!$F$13),\"N/A\",\"\")","v":""}]
[null,{"$f":"Survey!B43","v":"14.  Is blank plate secured or missing on B-cabinets?  If secured, enter YES and if not enter NO. If blank plate is missing, enter M."},null,null,null,null,null,null,null,{"$f":"IF(ISBLANK(Survey!$F$13),\"N/A\",IF(LEN(Survey!$M$13)>15,\"N/A\",IF(MID(Survey!$M$13,4,3)<=\"072\",\"N/A\",IF(MID(Survey!$M$13,4,3)>=\"180\",\"N/A\",\"\"))))","v":"N/A"}]
[null,{"$f":"Survey!B45","v":"15.  Is ductwork lined?  If ductwork is lined, is it intact and undamaged?  If so, enter I.  If ductwork damaged and/or deteriorating, enter D.  If ductwork is not lined, enter NO."},null,null,null,null,null,null,null,{"$f":"IF(ISBLANK(Survey!$F$13),\"N/A\",\"\")","v":""}]
[null,{"$f":"Survey!B47","v":"16. Are turning vanes present in the supply ducts of the units?  If turning vanes present enter YES and if not enter NO."},null,null,null,null,null,null,null,{"$f":"IF(ISBLANK(Survey!$F$13),\"N/A\",\"\")","v":""}]
[null,{"$f":"Survey!B49","v":"17. Are turning vanes single or double thickness?  If turning vanes double, enter D and if single enter S."},null,null,null,null,null,null,null,{"$f":"IF(ISBLANK(Survey!$F$13),\"N/A\",IF(MID(J23,1,2)=\"NO\",\"N/A\",\"\"))","v":""},{"$f":"IF(MID($K$23,1,2)=\"NO\",\"N/A\",\"\")","v":""},null,{"$f":"IF(MID($K$23,1,2)=\"NO\",\"N/A\",\"\")","v":""}]
[null,{"$f":"Survey!B51","v":"18. Is canvas connector missing or damaged?  If no connector present, enter NO and if present enter YES.  If connector damaged enter D."},null,null,null,null,null,null,null,{"$f":"IF(ISBLANK(Survey!$F$13),\"N/A\",\"\")","v":""}]
[null,{"$f":"Survey!B53","v":"19.  If turning vanes not present, is drop radiused?  If so, does radius equal the width of the duct? If radius does not equal duct width, enter NO and if does enter YES."},null,null,null,null,null,null,null,{"$f":"IF(ISBLANK(Survey!$F$13),\"N/A\",IF(MID(J23,1,3)=\"YES\",\"N/A\",\"\"))","v":""},{"$f":"IF(MID($K$23,1,2)=\"NO\",\"N/A\",\"\")","v":""},null,{"$f":"IF(MID($K$23,1,2)=\"NO\",\"N/A\",\"\")","v":""}]
[null,{"$f":"Survey!B55","v":"20.  Check economizer setting at Master Control Boad.  If economizer set to zero, TAB to set the economizer position to the TAB sticker setpoint or damper shaft marking (If it exists) or to 20% open should no sticker or shaft marking exists.  If economizer doesn't stroke to desired position, enter \"D\" for deficiency.  If no deficiency enter ND."},null,null,null,null,null,null,null,{"$f":"IF(ISBLANK(Survey!$F$13),\"N/A\",\"\")","v":""}]
[null,{"$f":"Survey!B57","v":"21.  Provide condensation pipe size.  Minimum 1\" at playland unit, and 1.25\" at all other units.  NOTE: DROP DOWN MENUS FOR PIPE SIZE."}]
[null,{"$f":"Survey!B59","v":"22.  Incorrect MFR of devices or equipment installed that does not match CFA specifications.  If incorrect manufacturer devices found, enter YES and decribe deficiency in miscellaneous notes.  If not enter NO."},null,null,null,null,null,null,null,{"$f":"IF(ISBLANK(Survey!$F$13),\"N/A\",\"\")","v":""}]
[null,"MISCELLENOUS NOTES"]

{"sheet":"RTU6","index":9,"n_rows":30,"n_cols":13,"rows_kept":30,"cut":false,"hidden":false,"merged":[[11,1,11,8],[0,1,0,4],[0,5,0,6],[1,1,1,4],[2,1,2,4],[3,1,3,4],[4,1,4,4],[4,5,4,8],[6,1,6,8],[7,1,7,8],[8,1,8,8],[9,1,9,8],[10,1,10,8],[5,1,5,8],[34,1,34,10],[13,1,13,8],[15,1,15,8],[16,1,16,8],[17,1,17,8],[18,1,18,8],[19,1,19,8],[20,1,20,8],[21,1,21,8],[22,1,22,8],[23,1,23,8],[14,1,14,8],[29,1,29,10],[30,1,30,10],[31,1,31,10],[32,1,32,10],[12,1,12,8],[33,1,33,10],[27,1,27,8],[25,1,25,8],[24,1,24,8],[26,1,26,8],[28,1,28,8]]}
[null,"RTU UNIT MANUFACTURER",null,null,null,{"$f":"Survey!AA14","v":""}]
[null,"RTU TYPE",null,null,null,{"$f":"Survey!AI14","v":""}]
[null,"MODEL NUMBER",null,null,null,{"$f":"Survey!M14","v":0}]
[null,"SERIAL NUMBER",null,null,null,{"$f":"Survey!F14","v":0}]
[null,null,null,null,null,"RTU TONNAGE",null,null,null,{"$f":"Survey!X14","v":""}]
[null,"DESCRIPTION",null,null,null,null,null,null,null,"CODE OUTPUT","ANSWER"]
[null,{"$f":"Survey!B17","v":"1.  Using punch/screwdriver, prod heat exchanger tubes.  If holes found and/or prod test fails enter YES, lockout unit and infom management. If not, enter NO."},null,null,null,null,null,null,null,{"$f":"IF(ISBLANK(Survey!$F$14),\"N/A\",\"\")","v":""}]
[null,{"$f":"Survey!B19","v":"2.  Quantify damage/deterioration to the condenser coil, and enter value 0% to 100%."},null,null,null,null,null,null,null,{"$f":"IF(ISBLANK(Survey!$F$14),\"N/A\",\"\")","v":""}]
[null,{"$f":"Survey!B21","v":"3.  Is there a hail guard installed on unit?  Enter YES or NO.  NOTE: If \"CRITICAL\", unit in top ten hail states."},null,null,null,null,null,null,null,{"$f":"IF(ISBLANK(Survey!$F$14),\"N/A\",\"\")","v":""}]
[null,{"$f":"Survey!B23","v":"4.  Quantify damage/deterioration evaporator coil, and enter value 0% to 100%."},null,null,null,null,null,null,null,{"$f":"IF(ISBLANK(Survey!$F$14),\"N/A\",\"\")","v":""}]
[null,{"$f":"Survey!B25","v":"5.  Check for power exhaust at AC units greater than ten tons.  If no power exhaust, enter NO.  If there is a power exhaust enter YES"},null,null,null,null,null,null,null,{"$f":"IF(ISBLANK(Survey!$F$14),\"N/A\",IF(MID(Survey!X14,4,3)<=\"120\",\"N/A\",))","v":"N/A"}]
[null,{"$f":"Survey!B27","v":"6.  Are there curb adaptors on any of the units?  Enter YES or NO."},null,null,null,null,null,null,null,{"$f":"IF(ISBLANK(Survey!$F$14),\"N/A\",\"\")","v":""}]
[null,"IS THE UNIT A DEHUMIDIFICATION TYPE UNIT?  ENTER YES OR NO?"]
[null,{"$f":"Survey!B29","v":"7.  If the unit is a dehumidification type unit,  does it have the humidistat device? If so enter YES or NO."},null,null,null,null,null,null,null,{"$f":"IF(ISBLANK(Survey!$F$14),\"N/A\",\"\")","v":""},{"$f":"IF(K13=\"NO\",\"N/A\",\"\")","v":""}]
[null,{"$f":"Survey!B31","v":"8.  If the unit is a dehumidification type unit,  is the wiring correct from the device to the RTU Master Control Board?  If so enter YES or NO.  Lennox = Two separate shielded ComCables; Trane = One shielded two conductor ComCable."},null,null,null,null,null,null,null,null,{"$f":"IF(K13=\"NO\",\"N/A\",\"\")","v":""}]
[null,{"$f":"Survey!B33","v":"9.  Is a smoke detector present in unit?  If no smoked detector, enter NO.  If there is a smoke detector, enter YES."},null,null,null,null,null,null,null,{"$f":"IF(ISBLANK(Survey!$F$14),\"N/A\",\"\")","v":""}]
[null,{"$f":"Survey!B35","v":"10.  Is the smoke detector inlet sampling tube capped?  If not capped, enter NO.  If capped enter YES."},null,null,null,null,null,null,null,{"$f":"IF(ISBLANK(Survey!$F$14),\"N/A\",IF(MID($J$16,1,2)=\"NO\",\"N/A\",\"\"))","v":""},{"$f":"IF(MID($K$16,1,2)=\"NO\",\"N/A\",\"\")","v":""},null,{"$f":"IF(MID($K$16,1,2)=\"NO\",\"N/A\",\"\")","v":""}]
[null,{"$f":"Survey!B37","v":"11.  Check smoke detector module light. If light RED or an AMBER color.  If either color, enter YES, and If not enter NO."},null,null,null,null,null,null,null,{"$f":"IF(ISBLANK(Survey!$F$14),\"N/A\",IF(MID($J$16,1,2)=\"NO\",\"N/A\",\"\"))","v":""},{"$f":"IF(MID($K$16,1,2)=\"NO\",\"N/A\",\"\")","v":""},null,{"$f":"IF(MID($K$16,1,2)=\"NO\",\"N/A\",\"\")","v":""}]
[null,{"$f":"Survey!B39","v":"12.  Is smoke detector dust plugs capped?  If capped, enter YES, and if not enter NO."},null,null,null,null,null,null,null,{"$f":"IF(ISBLANK(Survey!$F$14),\"N/A\",IF(MID($J$16,1,2)=\"NO\",\"N/A\",\"\"))","v":""},{"$f":"IF(MID($K$16,1,2)=\"NO\",\"N/A\",\"\")","v":""},null,{"$f":"IF(MID($K$16,1,2)=\"NO\",\"N/A\",\"\")","v":""}]
[null,{"$f":"Survey!B41","v":"13.  Identify any damage to the blower.  If DAMAGE found, enter YES and if not enter NO.  Describe issue in Miscellaneous notes."},null,null,null,null,null,null,null,{"$f":"IF(ISBLANK(Survey!$F$14),\"N/A\",\"\")","v":""}]
[null,{"$f":"Survey!B43","v":"14.  Is blank plate secured or missing on B-cabinets?  If secured, enter YES and if not enter NO. If blank plate is missing, enter M."},null,null,null,null,null,null,null,{"$f":"IF(ISBLANK(Survey!$F$14),\"N/A\",IF(LEN(Survey!$M$14)>15,\"N/A\",IF(MID(Survey!$M$14,4,3)<=\"072\",\"N/A\",IF(MID(Survey!$M$14,4,3)>=\"180\",\"N/A\",\"\"))))","v":"N/A"}]
[null,{"$f":"Survey!B45","v":"15.  Is ductwork lined?  If ductwork is lined, is it intact and undamaged?  If so, enter I.  If ductwork damaged and/or deteriorating, enter D.  If ductwork is not lined, enter NO."},null,null,null,null,null,null,null,{"$f":"IF(ISBLANK(Survey!$F$14),\"N/A\",\"\")","v":""}]
[null,{"$f":"Survey!B47","v":"16. Are turning vanes present in the supply ducts of the units?  If turning vanes present enter YES and if not enter NO."},null,null,null,null,null,null,null,{"$f":"IF(ISBLANK(Survey!$F$14),\"N/A\",\"\")","v":""}]
[null,{"$f":"Survey!B49","v":"17. Are turning vanes single or double thickness?  If turning vanes double, enter D and if single enter S."},null,null,null,null,null,null,null,{"$f":"IF(ISBLANK(Survey!$F$14),\"N/A\",IF(MID(J23,1,2)=\"NO\",\"N/A\",\"\"))","v":""},{"$f":"IF(MID($K$23,1,2)=\"NO\",\"N/A\",\"\")","v":""},null,{"$f":"IF(MID($K$23,1,2)=\"NO\",\"N/A\",\"\")","v":""}]
[null,{"$f":"Survey!B51","v":"18. Is canvas connector missing or damaged?  If no connector present, enter NO and if present enter YES.  If connector damaged enter D."},null,null,null,null,null,null,null,{"$f":"IF(ISBLANK(Survey!$F$14),\"N/A\",\"\")","v":""}]
[null,{"$f":"Survey!B53","v":"19.  If turning vanes not present, is drop radiused?  If so, does radius equal the width of the duct? If radius does not equal duct width, enter NO and if does enter YES."},null,null,null,null,null,null,null,{"$f":"IF(ISBLANK(Survey!$F$14),\"N/A\",IF(MID(J23,1,3)=\"YES\",\"N/A\",\"\"))","v":""},{"$f":"IF(MID($K$23,1,2)=\"NO\",\"N/A\",\"\")","v":""},null,{"$f":"IF(MID($K$23,1,2)=\"NO\",\"N/A\",\"\")","v":""}]
[null,{"$f":"Survey!B55","v":"20.  Check economizer setting at Master Control Boad.  If economizer set to zero, TAB to set the economizer position to the TAB sticker setpoint or damper shaft marking (If it exists) or to 20% open should no sticker or shaft marking exists.  If economizer doesn't stroke to desired position, enter \"D\" for deficiency.  If no deficiency enter ND."},null,null,null,null,null,null,null,{"$f":"IF(ISBLANK(Survey!$F$14),\"N/A\",\"\")","v":""}]
[null,{"$f":"Survey!B57","v":"21.  Provide condensation pipe size.  Minimum 1\" at playland unit, and 1.25\" at all other units.  NOTE: DROP DOWN MENUS FOR PIPE SIZE."}]
[null,{"$f":"Survey!B59","v":"22.  Incorrect MFR of devices or equipment installed that does not match CFA specifications.  If incorrect manufacturer devices found, enter YES and decribe deficiency in miscellaneous notes.  If not enter NO."},null,null,null,null,null,null,null,{"$f":"IF(ISBLANK(Survey!$F$14),\"N/A\",\"\")","v":""}]
[null,"MISCELLENOUS NOTES"]

{"sheet":"RTU7","index":10,"n_rows":29,"n_cols":13,"rows_kept":29,"cut":false,"hidden":false,"merged":[[30,1,30,10],[31,1,31,10],[32,1,32,10],[33,1,33,10],[1,5,1,7],[2,5,2,7],[3,5,3,7],[24,1,24,8],[25,1,25,8],[26,1,26,8],[27,1,27,8],[28,1,28,10],[29,1,29,10],[18,1,18,8],[19,1,19,8],[20,1,20,8],[21,1,21,8],[22,1,22,8],[23,1,23,8],[12,1,12,8],[13,1,13,8],[14,1,14,8],[15,1,15,8],[16,1,16,8],[17,1,17,8],[11,1,11,8],[0,1,0,4],[0,5,0,6],[1,1,1,4],[2,1,2,4],[3,1,3,4],[4,1,4,4],[4,5,4,8],[5,1,5,8],[6,1,6,8],[7,1,7,8],[8,1,8,8],[9,1,9,8],[10,1,10,8]]}
[null,"RTU UNIT MANUFACTURER",null,null,null,{"$f":"Survey!AA15","v":""}]
[null,"RTU TYPE",null,null,null,{"$f":"Survey!E15","v":0}]
[null,"MODEL NUMBER",null,null,null,{"$f":"Survey!M15","v":0}]
[null,"SERIAL NUMBER",null,null,null,{"$f":"Survey!F15","v":0}]
[null,null,null,null,null,"RTU TONNAGE",null,null,null,{"$f":"Survey!X15","v":""}]
[null,"DESCRIPTION",null,null,null,null,null,null,null,"CODE OUTPUT","ANSWER"]
[null,{"$f":"Survey!B17","v":"1.  Using punch/screwdriver, prod heat exchanger tubes.  If holes found and/or prod test fails enter YES, lockout unit and infom management. If not, enter NO."},null,null,null,null,null,null,null,{"$f":"IF(ISBLANK(Survey!$F$15),\"N/A\",\"\")","v":""}]
[null,{"$f":"Survey!B19","v":"2.  Quantify damage/deterioration to the condenser coil, and enter value 0% to 100%."},null,null,null,null,null,null,null,{"$f":"IF(ISBLANK(Survey!$F$15),\"N/A\",\"\")","v":""}]
[null,{"$f":"Survey!B21","v":"3.  Is there a hail guard installed on unit?  Enter YES or NO.  NOTE: If \"CRITICAL\", unit in top ten hail states."},null,null,null,null,null,null,null,{"$f":"IF(ISBLANK(Survey!$F$15),\"N/A\",\"\")","v":""}]
[null,{"$f":"Survey!B23","v":"4.  Quantify damage/deterioration evaporator coil, and enter value 0% to 100%."},null,null,null,null,null,null,null,{"$f":"IF(ISBLANK(Survey!$F$15),\"N/A\",\"\")","v":""}]
[null,{"$f":"Survey!B25","v":"5.  Check for power exhaust at AC units greater than ten tons.  If no power exhaust, enter NO.  If there is a power exhaust enter YES"},null,null,null,null,null,null,null,{"$f":"IF(ISBLANK(Survey!$F$15),\"N/A\",IF(MID(Survey!X15,4,3)<=\"120\",\"N/A\",))","v":"N/A"}]
[null,{"$f":"Survey!B27","v":"6.  Are there curb adaptors on any of the units?  Enter YES or NO."},null,null,null,null,null,null,null,{"$f":"IF(ISBLANK(Survey!$F$15),\"N/A\",\"\")","v":""}]
[null,{"$f":"Survey!B29","v":"7.  If the unit is a dehumidification type unit,  does it have the humidistat device? If so enter YES or NO."},null,null,null,null,null,null,null,{"$f":"IF(ISBLANK(Survey!$F$15),\"N/A\",\"\")","v":""}]
[null,{"$f":"Survey!B31","v":"8.  If the unit is a dehumidification type unit,  is the wiring correct from the device to the RTU Master Control Board?  If so enter YES or NO.  Lennox = Two separate shielded ComCables; Trane = One shielded two conductor ComCable."}]
[null,{"$f":"Survey!B33","v":"9.  Is a smoke detector present in unit?  If no smoked detector, enter NO.  If there is a smoke detector, enter YES."},null,null,null,null,null,null,null,{"$f":"IF(ISBLANK(Survey!$F$15),\"N/A\",\"\")","v":""}]
[null,{"$f":"Survey!B35","v":"10.  Is the smoke detector inlet sampling tube capped?  If not capped, enter NO.  If capped enter YES."},null,null,null,null,null,null,null,{"$f":"IF(ISBLANK(Survey!$F$15),\"N/A\",IF(MID($J$15,1,2)=\"NO\",\"N/A\",\"\"))","v":""},{"$f":"IF(MID($K$15,1,2)=\"NO\",\"N/A\",\"\")","v":""},null,{"$f":"IF(MID($K$15,1,2)=\"NO\",\"N/A\",\"\")","v":""}]
[null,{"$f":"Survey!B37","v":"11.  Check smoke detector module light. If light RED or an AMBER color.  If either color, enter YES, and If not enter NO."},null,null,null,null,null,null,null,{"$f":"IF(ISBLANK(Survey!$F$15),\"N/A\",IF(MID($J$15,1,2)=\"NO\",\"N/A\",\"\"))","v":""},{"$f":"IF(MID($K$15,1,2)=\"NO\",\"N/A\",\"\")","v":""},null,{"$f":"IF(MID($K$15,1,2)=\"NO\",\"N/A\",\"\")","v":""}]
[null,{"$f":"Survey!B39","v":"12.  Is smoke detector dust plugs capped?  If capped, enter YES, and if not enter NO."},null,null,null,null,null,null,null,{"$f":"IF(ISBLANK(Survey!$F$15),\"N/A\",IF(MID($J$15,1,2)=\"NO\",\"N/A\",\"\"))","v":""},{"$f":"IF(MID($K$15,1,2)=\"NO\",\"N/A\",\"\")","v":""},null,{"$f":"IF(MID($K$15,1,2)=\"NO\",\"N/A\",\"\")","v":""}]
[null,{"$f":"Survey!B41","v":"13.  Identify any damage to the blower.  If DAMAGE found, enter YES and if not enter NO.  Describe issue in Miscellaneous notes."},null,null,null,null,null,null,null,{"$f":"IF(ISBLANK(Survey!$F$15),\"N/A\",\"\")","v":""}]
[null,{"$f":"Survey!B43","v":"14.  Is blank plate secured or missing on B-cabinets?  If secured, enter YES and if not enter NO. If blank plate is missing, enter M."},null,null,null,null,null,null,null,{"$f":"IF(ISBLANK(Survey!$F$15),\"N/A\",IF(LEN(Survey!$M$15)>15,\"N/A\",IF(MID(Survey!$M$15,4,3)<=\"072\",\"N/A\",IF(MID(Survey!$M$15,4,3)>=\"180\",\"N/A\",\"\"))))","v":"N/A"}]
[null,{"$f":"Survey!B45","v":"15.  Is ductwork lined?  If ductwork is lined, is it intact and undamaged?  If so, enter I.  If ductwork damaged and/or deteriorating, enter D.  If ductwork is not lined, enter NO."},null,null,null,null,null,null,null,{"$f":"IF(ISBLANK(Survey!$F$15),\"N/A\",\"\")","v":""}]
[null,{"$f":"Survey!B47","v":"16. Are turning vanes present in the supply ducts of the units?  If turning vanes present enter YES and if not enter NO."},null,null,null,null,null,null,null,{"$f":"IF(ISBLANK(Survey!$F$15),\"N/A\",\"\")","v":""}]
[null,{"$f":"Survey!B49","v":"17. Are turning vanes single or double thickness?  If turning vanes double, enter D and if single enter S."},null,null,null,null,null,null,null,{"$f":"IF(ISBLANK(Survey!$F$15),\"N/A\",IF(MID(J22,1,2)=\"NO\",\"N/A\",\"\"))","v":""},{"$f":"IF(MID($K$22,1,2)=\"NO\",\"N/A\",\"\")","v":""},null,{"$f":"IF(MID($K$22,1,2)=\"NO\",\"N/A\",\"\")","v":""}]
[null,{"$f":"Survey!B51","v":"18. Is canvas connector missing or damaged?  If no connector present, enter NO and if present enter YES.  If connector damaged enter D."},null,null,null,null,null,null,null,{"$f":"IF(ISBLANK(Survey!$F$15),\"N/A\",\"\")","v":""}]
[null,{"$f":"Survey!B53","v":"19.  If turning vanes not present, is drop radiused?  If so, does radius equal the width of the duct? If radius does not equal duct width, enter NO and if does enter YES."},null,null,null,null,null,null,null,{"$f":"IF(ISBLANK(Survey!$F$15),\"N/A\",IF(MID(J22,1,3)=\"YES\",\"N/A\",\"\"))","v":""},{"$f":"IF(MID($K$22,1,2)=\"NO\",\"N/A\",\"\")","v":""},null,{"$f":"IF(MID($K$22,1,2)=\"NO\",\"N/A\",\"\")","v":""}]
[null,{"$f":"Survey!B55","v":"20.  Check economizer setting at Master Control Boad.  If economizer set to zero, TAB to set the economizer position to the TAB sticker setpoint or damper shaft marking (If it exists) or to 20% open should no sticker or shaft marking exists.  If economizer doesn't stroke to desired position, enter \"D\" for deficiency.  If no deficiency enter ND."},null,null,null,null,null,null,null,{"$f":"IF(ISBLANK(Survey!$F$15),\"N/A\",\"\")","v":""}]
[null,{"$f":"Survey!B57","v":"21.  Provide condensation pipe size.  Minimum 1\" at playland unit, and 1.25\" at all other units.  NOTE: DROP DOWN MENUS FOR PIPE SIZE."}]
[null,{"$f":"Survey!B59","v":"22.  Incorrect MFR of devices or equipment installed that does not match CFA specifications.  If incorrect manufacturer devices found, enter YES and decribe deficiency in miscellaneous notes.  If not enter NO."},null,null,null,null,null,null,null,{"$f":"IF(ISBLANK(Survey!$F$15),\"N/A\",\"\")","v":""}]
[null,"MISCELLENOUS NOTES"]

{"sheet":"RTU8","index":11,"n_rows":29,"n_cols":13,"rows_kept":29,"cut":false,"hidden":false,"merged":[[32,1,32,10],[33,1,33,10],[26,1,26,8],[27,1,27,8],[28,1,28,10],[29,1,29,10],[30,1,30,10],[31,1,31,10],[25,1,25,8],[14,1,14,8],[15,1,15,8],[16,1,16,8],[17,1,17,8],[18,1,18,8],[19,1,19,8],[20,1,20,8],[21,1,21,8],[22,1,22,8],[23,1,23,8],[24,1,24,8],[13,1,13,8],[3,1,3,4],[3,5,3,7],[4,1,4,4],[4,5,4,8],[6,1,6,8],[7,1,7,8],[5,1,5,8],[8,1,8,8],[9,1,9,8],[10,1,10,8],[11,1,11,8],[12,1,12,8],[0,1,0,4],[0,5,0,6],[1,1,1,4],[1,5,1,7],[2,1,2,4],[2,5,2,7]]}
[null,"RTU UNIT MANUFACTURER",null,null,null,{"$f":"Survey!AA16","v":""}]
[null,"RTU TYPE",null,null,null,{"$f":"Survey!E16","v":0}]
[null,"MODEL NUMBER",null,null,null,{"$f":"Survey!M16","v":0}]
[null,"SERIAL NUMBER",null,null,null,{"$f":"Survey!F16","v":0}]
[null,null,null,null,null,"RTU TONNAGE",null,null,null,{"$f":"Survey!X16","v":""}]
[null,"DESCRIPTION",null,null,null,null,null,null,null,"CODE OUTPUT","ANSWER"]
[null,{"$f":"Survey!B17","v":"1.  Using punch/screwdriver, prod heat exchanger tubes.  If holes found and/or prod test fails enter YES, lockout unit and infom management. If not, enter NO."},null,null,null,null,null,null,null,{"$f":"IF(ISBLANK(Survey!$F$18),\"N/A\",\"\")","v":""}]
[null,{"$f":"Survey!B19","v":"2.  Quantify damage/deterioration to the condenser coil, and enter value 0% to 100%."},null,null,null,null,null,null,null,{"$f":"IF(ISBLANK(Survey!$F$18),\"N/A\",\"\")","v":""}]
[null,{"$f":"Survey!B21","v":"3.  Is there a hail guard installed on unit?  Enter YES or NO.  NOTE: If \"CRITICAL\", unit in top ten hail states."},null,null,null,null,null,null,null,{"$f":"IF(ISBLANK(Survey!$F$18),\"N/A\",\"\")","v":""}]
[null,{"$f":"Survey!B23","v":"4.  Quantify damage/deterioration evaporator coil, and enter value 0% to 100%."},null,null,null,null,null,null,null,{"$f":"IF(ISBLANK(Survey!$F$18),\"N/A\",\"\")","v":""}]
[null,{"$f":"Survey!B25","v":"5.  Check for power exhaust at AC units greater than ten tons.  If no power exhaust, enter NO.  If there is a power exhaust enter YES"},null,null,null,null,null,null,null,{"$f":"IF(ISBLANK(Survey!$F$18),\"N/A\",IF(MID(Survey!X16,4,3)<=\"120\",\"N/A\",\"\"))","v":"N/A"}]
[null,{"$f":"Survey!B27","v":"6.  Are there curb adaptors on any of the units?  Enter YES or NO."},null,null,null,null,null,null,null,{"$f":"IF(ISBLANK(Survey!$F$18),\"N/A\",\"\")","v":""}]
[null,{"$f":"Survey!B29","v":"7.  If the unit is a dehumidification type unit,  does it have the humidistat device? If so enter YES or NO."},null,null,null,null,null,null,null,{"$f":"IF(ISBLANK(Survey!$F$18),\"N/A\",\"\")","v":""}]
[null,{"$f":"Survey!B31","v":"8.  If the unit is a dehumidification type unit,  is the wiring correct from the device to the RTU Master Control Board?  If so enter YES or NO.  Lennox = Two separate shielded ComCables; Trane = One shielded two conductor ComCable."}]
[null,{"$f":"Survey!B33","v":"9.  Is a smoke detector present in unit?  If no smoked detector, enter NO.  If there is a smoke detector, enter YES."},null,null,null,null,null,null,null,{"$f":"IF(ISBLANK(Survey!$F$18),\"N/A\",\"\")","v":""}]
[null,{"$f":"Survey!B35","v":"10.  Is the smoke detector inlet sampling tube capped?  If not capped, enter NO.  If capped enter YES."},null,null,null,null,null,null,null,{"$f":"IF(ISBLANK(Survey!$F$18),\"N/A\",IF(MID($J$15,1,2)=\"NO\",\"N/A\",\"\"))","v":""},{"$f":"IF(ISBLANK(Survey!$E$9),\"N/A\",IF(MID($K$15,1,2)=\"NO\",\"N/A\",\"\"))","v":"N/A"},null,{"$f":"IF(ISBLANK(Survey!$E$9),\"N/A\",IF(MID($K$15,1,2)=\"NO\",\"N/A\",\"\"))","v":"N/A"}]
[null,{"$f":"Survey!B37","v":"11.  Check smoke detector module light. If light RED or an AMBER color.  If either color, enter YES, and If not enter NO."},null,null,null,null,null,null,null,{"$f":"IF(ISBLANK(Survey!$F$18),\"N/A\",IF(MID($J$15,1,2)=\"NO\",\"N/A\",\"\"))","v":""},{"$f":"IF(ISBLANK(Survey!$E$9),\"N/A\",IF(MID($K$15,1,2)=\"NO\",\"N/A\",\"\"))","v":"N/A"},null,{"$f":"IF(ISBLANK(Survey!$E$9),\"N/A\",IF(MID($K$15,1,2)=\"NO\",\"N/A\",\"\"))","v":"N/A"}]
[null,{"$f":"Survey!B39","v":"12.  Is smoke detector dust plugs capped?  If capped, enter YES, and if not enter NO."},null,null,null,null,null,null,null,{"$f":"IF(ISBLANK(Survey!$F$18),\"N/A\",IF(MID($J$15,1,2)=\"NO\",\"N/A\",\"\"))","v":""},{"$f":"IF(ISBLANK(Survey!$E$9),\"N/A\",IF(MID($K$15,1,2)=\"NO\",\"N/A\",\"\"))","v":"N/A"},null,{"$f":"IF(ISBLANK(Survey!$E$9),\"N/A\",IF(MID($K$15,1,2)=\"NO\",\"N/A\",\"\"))","v":"N/A"}]
[null,{"$f":"Survey!B41","v":"13.  Identify any damage to the blower.  If DAMAGE found, enter YES and if not enter NO.  Describe issue in Miscellaneous notes."},null,null,null,null,null,null,null,{"$f":"IF(ISBLANK(Survey!$F$18),\"N/A\",\"\")","v":""}]
[null,{"$f":"Survey!B43","v":"14.  Is blank plate secured or missing on B-cabinets?  If secured, enter YES and if not enter NO. If blank plate is missing, enter M."},null,null,null,null,null,null,null,{"$f":"IF(ISBLANK(Survey!$F$18),\"N/A\",IF(LEN(Survey!$M$16)>15,\"N/A\",IF(MID(Survey!$M$16,4,3)<=\"072\",\"N/A\",IF(MID(Survey!$M$16,4,3)>=\"180\",\"N/A\",\"\"))))","v":"N/A"}]
[null,{"$f":"Survey!B45","v":"15.  Is ductwork lined?  If ductwork is lined, is it intact and undamaged?  If so, enter I.  If ductwork damaged and/or deteriorating, enter D.  If ductwork is not lined, enter NO."},null,null,null,null,null,null,null,{"$f":"IF(ISBLANK(Survey!$F$18),\"N/A\",\"\")","v":""}]
[null,{"$f":"Survey!B47","v":"16. Are turning vanes present in the supply ducts of the units?  If turning vanes present enter YES and if not enter NO."},null,null,null,null,null,null,null,{"$f":"IF(ISBLANK(Survey!$F$18),\"N/A\",\"\")","v":""}]
[null,{"$f":"Survey!B49","v":"17. Are turning vanes single or double thickness?  If turning vanes double, enter D and if single enter S."},null,null,null,null,null,null,null,{"$f":"IF(ISBLANK(Survey!$F$18),\"N/A\",IF(MID(J22,1,2)=\"NO\",\"N/A\",\"\"))","v":""},{"$f":"IF(ISBLANK(Survey!$E$9),\"N/A\",IF(MID($K$22,1,2)=\"NO\",\"N/A\",\"\"))","v":"N/A"},null,{"$f":"IF(ISBLANK(Survey!$E$9),\"N/A\",IF(MID($K$22,1,2)=\"NO\",\"N/A\",\"\"))","v":"N/A"}]
[null,{"$f":"Survey!B51","v":"18. Is canvas connector missing or damaged?  If no connector present, enter NO and if present enter YES.  If connector damaged enter D."},null,null,null,null,null,null,null,{"$f":"IF(ISBLANK(Survey!$E$18),\"N/A\",\"\")","v":"N/A"}]
[null,{"$f":"Survey!B53","v":"19.  If turning vanes not present, is drop radiused?  If so, does radius equal the width of the duct? If radius does not equal duct width, enter NO and if does enter YES."},null,null,null,null,null,null,null,{"$f":"IF(ISBLANK(Survey!$F$18),\"N/A\",IF(MID(J22,1,3)=\"YES\",\"N/A\",\"\"))","v":""}]
[null,{"$f":"Survey!B55","v":"20.  Check economizer setting at Master Control Boad.  If economizer set to zero, TAB to set the economizer position to the TAB sticker setpoint or damper shaft marking (If it exists) or to 20% open should no sticker or shaft marking exists.  If economizer doesn't stroke to desired position, enter \"D\" for deficiency.  If no deficiency enter ND."},null,null,null,null,null,null,null,{"$f":"IF(ISBLANK(Survey!$F$18),\"N/A\",\"\")","v":""}]
[null,{"$f":"Survey!B57","v":"21.  Provide condensation pipe size.  Minimum 1\" at playland unit, and 1.25\" at all other units.  NOTE: DROP DOWN MENUS FOR PIPE SIZE."}]
[null,{"$f":"Survey!B59","v":"22.  Incorrect MFR of devices or equipment installed that does not match CFA specifications.  If incorrect manufacturer devices found, enter YES and decribe deficiency in miscellaneous notes.  If not enter NO."},null,null,null,null,null,null,null,{"$f":"IF(ISBLANK(Survey!$F$18),\"N/A\",\"\")","v":""}]
[null,"MISCELLENOUS NOTES"]

{"sheet":"EF Thermostat","index":12,"n_rows":26,"n_cols":9,"rows_kept":26,"cut":false,"hidden":false,"merged":[[25,2,25,10],[2,1,3,10],[17,1,17,10],[6,1,6,9],[8,1,8,9],[13,1,13,9],[10,1,10,9],[11,1,11,6],[12,1,12,6],[14,1,14,10],[16,7,16,10],[11,7,11,9],[12,7,12,9],[18,2,18,10],[20,2,20,10],[22,2,22,10],[24,2,24,10],[4,1,4,9],[19,2,19,10],[21,2,21,10],[23,2,23,10]]}
[]
[]
[null,"EXHAUST FANS/SUNCOAST PANEL/ THERMOSTATS"]
[]
[null,{"$f":"Survey!B62","v":"1.  Incorrect MFR of devices or equipment installed that does not match CFA specifications.  If incorrect manufacturer devices found, enter YES and decribe deficiency in miscellaneous note E#.  If not enter NO."}]
[null,"EF1",null,"EF2",null,"EF3",null,"EF4"]
[null,{"$f":"Survey!B64","v":"2.  Loose or missing access doors or gasketes on the grease ductwork.  Grease exhaust duct dampers - Halton Kitchen Volume Damper.  If issues found with access doors, enter YES and describe in miscelleneous note E#a.  If no issues, enter NO.  If gaskets missing enter MG."}]
[null,"EF1",null,"EF2",null,"EF3",null,"EF4"]
[null,{"$f":"Survey!B66","v":"3.  Exhaust System - Wrong HP motor in rooftop exhaust equipment.  If incorrect HP, enter YES and if correct enter NO."}]
[null,"EF1",null,"EF2",null,"EF3",null,"EF4"]
[null,{"$f":"Survey!B68","v":"4.  Does bathroom exhaust fan duct have a liner?  Enter YES or NO."}]
[null,{"$f":"Survey!B69","v":"5.  Record model number of Suncoast Panel"}]
[null,{"$f":"Survey!B70","v":"6.  Record serial number of Suncoast Panel."}]
[null,{"$f":"Survey!B71","v":"7.  Is there a HES control panel visible?  Enter YES or NO."}]
[null,{"$f":"Survey!B72","v":"8.  Are thermostats Robert Shaw (Gray Display) or Network (Blue Display)? Enter \"RS\", \"NW\" for Robert Shaw and Network respectively.  If thermostat not Robert Shaw or Network enter NO."}]
[null,"AC1",null,"AC2",null,"AC3",null,"AC4","RS"]
[null,"AC6",null,"AC7",null,"AC8"]
[null,"MISCELLENOUS NOTES"]
[null,"EF1"]
[null,"EF1a"]
[null,"EF2"]
[null,"EF2a"]
[null,"EF3"]
[null,"EF3a"]
[null,"EF4"]
[null,"EF4a"]

{"sheet":"RUSCOMP","index":13,"n_rows":159,"n_cols":16,"rows_kept":159,"cut":false,"hidden":true,"merged":[[154,1,154,10],[155,1,155,10],[156,1,156,10],[157,1,157,10],[158,1,158,10],[149,1,149,10],[150,1,150,10],[151,1,151,10],[152,1,152,10],[153,1,153,10],[144,1,144,10],[145,1,145,10],[146,1,146,10],[147,1,147,10],[148,1,148,10],[139,1,139,10],[140,1,140,10],[141,1,141,10],[142,1,142,10],[143,1,143,10],[132,1,132,10],[134,1,134,10],[136,1,136,10],[137,1,137,10],[138,1,138,10],[127,1,127,10],[128,1,128,10],[129,1,129,10],[130,1,130,10],[131,1,131,10],[122,1,122,10],[123,1,123,10],[124,1,124,10],[125,1,125,10],[126,1,126,10],[117,1,117,10],[118,1,118,10],[119,1,119,10],[120,1,120,10],[121,1,121,10],[112,1,112,10],[113,1,113,10],[114,1,114,10],[115,1,115,10],[116,1,116,10],[105,1,105,10],[106,1,106,10],[108,1,108,10],[110,1,110,10],[111,1,111,10],[100,1,100,10],[101,1,101,10],[102,1,102,10],[103,1,103,10],[104,1,104,10],[95,1,95,10],[96,1,96,10],[97,1,97,10],[98,1,98,10],[99,1,99,10],[90,1,90,10],[91,1,91,10],[92,1,92,10],[93,1,93,10],[94,1,94,10],[56,1,56,10],[58,1,58,10],[87,1,87,10],[88,1,88,10],[89,1,89,10],[76,1,76,10],[77,1,77,10],[78,1,78,10],[60,1,60,10],[61,1,61,10],[62,1,62,10],[63,1,63,10],[82,1,82,10],[84,1,84,10],[85,1,85,10],[86,1,86,10],[79,1,79,10],[80,1,80,10],[38,1,38,10],[39,1,39,10],[50,1,50,10],[51,1,51,10],[52,1,52,10],[53,1,53,10],[54,1,54,10],[45,1,45,10],[46,1,46,10],[47,1,47,10],[48,1,48,10],[49,1,49,10],[32,1,32,10],[33,1,33,10],[74,1,74,10],[75,1,75,10],[69,1,69,10],[70,1,70,10],[71,1,71,10],[72,1,72,10],[73,1,73,10],[64,1,64,10],[65,1,65,10],[66,1,66,10],[67,1,67,10],[68,1,68,10],[59,1,59,10],[34,1,34,10],[40,1,40,10],[41,1,41,10],[42,1,42,10],[43,1,43,10],[44,1,44,10],[35,1,35,10],[36,1,36,10],[37,1,37,10],[22,1,22,10],[23,1,23,10],[24,1,24,10],[25,1,25,10],[30,1,30,10],[27,1,27,10],[26,1,26,10],[28,1,28,10],[20,1,20,10],[18,1,18,10],[19,1,19,10],[21,1,21,10],[8,1,8,10],[1,1,1,10],[3,1,3,10],[5,1,5,10],[6,1,6,10],[7,1,7,10],[9,1,9,10],[10,1,10,10],[11,1,11,10],[12,1,12,10],[13,1,13,10],[14,1,14,10],[15,1,15,10],[16,1,16,10],[17,1,17,10]]}
[]
[null,{"$f":"Survey!F3","v":"Bristow FSU"}]
[]
[null,"ROOFTOP UNIT #ONE"]
[]
[]
[1,{"$f":"IF(Survey!$F$18=\"N/A\",[1]MASTERSCOPES!$E$7,IF(Survey!$F$18=\"NO\",'MASTER SCOPES'!$E$6,IF(AND(Survey!$F$18=\"YES\",$J$6>75),'MASTER SCOPES'!$J$7,IF(AND(Survey!$F$18=\"YES\",$J$6<=75),'MASTER SCOPES'!$E$9,\"\"))))","v":""}]
[2,{"$f":"IF(Survey!$F$20=0,\"\",IF(Survey!$F$20=\"N/A\",[1]MASTERSCOPES!$E$13,IF(Survey!$F$20<50,'MASTER SCOPES'!$E$12,IF(Survey!$F$20>=50,'MASTER SCOPES'!$E$11,\"\"))))","v":{"$error":"#REF!"}}]
[3,{"$f":"IF(Survey!$F$22=0,\"\",IF(Survey!$F$22=\"N/A\",'MASTER SCOPES'!$E$17,IF(Survey!$F$22=\"N/A\",'MASTER SCOPES'!$E$18,IF(Survey!$F$22=\"YES\",'MASTER SCOPES'!$E$18,IF(AND(OR('HVAC SCOPE'!$K$5=\"NC\",'HVAC SCOPE'!$K$5=\"IA\",'HVAC SCOPE'!$K$5=\"MN\",'HVAC SCOPE'!$K$5=\"TX\",'HVAC SCOPE'!$K$5=\"AR\",'HVAC SCOPE'!$K$5=\"MO\",'HVAC SCOPE'!$K$5=\"KS\",'HVAC SCOPE'!$K$5=\"NEB\",'HVAC SCOPE'!$K$5-\"SD\"),Survey!$F$22=\"NO\"),'MASTER SCOPES'!$E$15,'MASTER SCOPES'!$E$16)))))","v":0}]
[4,{"$f":"IF(Survey!$F$24=0,\"\",IF(Survey!$F$24=\"N/A\",'MASTER SCOPES'!$E$22,IF(Survey!$F$24<50,'MASTER SCOPES'!$E$12,IF(Survey!$F$24>=50,'MASTER SCOPES'!$E$20,\"\"))))","v":0},null,null,null,null,null,null,null,null,null,null,null,null,null,"  "]
[5,{"$f":"IF(Survey!$F$26=\"N/A\",'MASTER SCOPES'!$E$25,IF(Survey!$F$26=0,\"\",IF(Survey!$F$26=\"YES\",'MASTER SCOPES'!$E$24,IF(Survey!$F$26=\"NO\",'MASTER SCOPES'!$E$26,\"\"))))","v":0}]
[6,{"$f":"IF(Survey!$F$28=\"N/A\",'MASTER SCOPES'!$E$29,IF(Survey!$F$28=\"NO\",'MASTER SCOPES'!$E$30,IF(Survey!$F$28=\"YES\",'MASTER SCOPES'!$E$28,\"\")))","v":0}]
[7,{"$f":"IF(Survey!$F$30=\"N/A\",'MASTER SCOPES'!$E$33,IF(Survey!$F$30=\"YES\",'MASTER SCOPES'!$E$32,IF(Survey!$F$30=\"NO\",'MASTER SCOPES'!$E$34,\"\")))","v":0}]
[8,{"$f":"IF(Survey!$F$32=0,\"\",IF(Survey!$F$32=\"N/A\",'MASTER SCOPES'!$E$37,IF(Survey!$F$32=\"YES\",'MASTER SCOPES'!$E$36,IF(AND(Survey!$F$32=\"NO\",Survey!AA9=\"Lennox\"),'MASTER SCOPES'!$E$38,IF(AND(Survey!$F$32=\"NO\",Survey!AA9=\"Trane\"),'MASTER SCOPES'!$E$39)))))","v":""}]
[9,{"$f":"IF(Survey!$F$34=0,\"\",IF(Survey!$F$34=\"N/A\",'MASTER SCOPES'!$E$42,IF(Survey!$F$34=\"NO\",'MASTER SCOPES'!$E$43,'MASTER SCOPES'!$E$41)))","v":""}]
[10,{"$f":"IF(Survey!$F$36=\"N/A\",'MASTER SCOPES'!$E$46,IF(Survey!$F$36=\"NO\",'MASTER SCOPES'!$E$47,IF(Survey!$F$36=\"YES\",'MASTER SCOPES'!$E$45,\"\")))","v":""}]
[11,{"$f":"IF(Survey!$F$38=\"N/A\",'MASTER SCOPES'!$E$50,IF(Survey!$F$38=\"YES\",'MASTER SCOPES'!$E$49,IF(Survey!$F$38=\"NO\",'MASTER SCOPES'!$E$51,\"\")))","v":""}]
[12,{"$f":"IF(Survey!$F$40=\"N/A\",'MASTER SCOPES'!$E$54,IF(Survey!$F$40=\"YES\",'MASTER SCOPES'!$E$53,IF(Survey!$F$40=\"NO\",'MASTER SCOPES'!$E$51,\"\")))","v":""}]
[13,{"$f":"IF(Survey!$F$42=0,\"\",IF(Survey!$F$42=\"N/A\",'MASTER SCOPES'!$E$59,IF(Survey!$F$42=\"NO\",'MASTER SCOPES'!$E$60,IF(AND(Survey!$F$42=\"YES\",'HVAC SCOPE'!J6>85),'MASTER SCOPES'!$E$57,'MASTER SCOPES'!$E$58))))","v":0}]
[14,{"$f":"IF(Survey!$F$44=0,\"\",IF(Survey!$F$44=\"N/A\",'MASTER SCOPES'!$E$63,IF(Survey!$F$44=\"NO\",'MASTER SCOPES'!$E$64,IF(Survey!$F$44=\"M\",'MASTER SCOPES'!$E$65,'MASTER SCOPES'!$E$62))))","v":0}]
[15,{"$f":"IF(Survey!$F$46=0,\"\",IF(Survey!$F$46=\"N/A\",'MASTER SCOPES'!$E$68,IF(Survey!$F$46=\"I\",'MASTER SCOPES'!$E$67,IF(Survey!$F$46=\"D\",'MASTER SCOPES'!$E$69,'MASTER SCOPES'!$E$67))))","v":0}]
[16,{"$f":"IF(Survey!$F$48=0,\"\",IF(Survey!$F$48=\"N/A\",'MASTER SCOPES'!$E$73,IF(Survey!$F$48=\"YES\",'MASTER SCOPES'!$E$71,IF(Survey!$F$48=\"NO\",'MASTER SCOPES'!E$72,\"\"))))","v":0}]
[17,{"$f":"IF(Survey!$F$50=0,\"\",IF(Survey!$F$50=\"N/A\",'MASTER SCOPES'!$E$76,IF(Survey!$F$50=\"D\",'MASTER SCOPES'!$E$75,IF(Survey!$F$50=\"S\",'MASTER SCOPES'!$E$77,\"\"))))","v":0}]
[18,{"$f":"IF(Survey!$F$52=0,\"\",IF(Survey!$F$52=\"N/A\",'MASTER SCOPES'!$E$80,IF(Survey!$F$52=\"YES\",'MASTER SCOPES'!$E$79,IF(OR(Survey!$F$52=\"NO\",Survey!$F$52=\"D\"),'MASTER SCOPES'!$E$81))))","v":0}]
[19,{"$f":"IF(Survey!$F$54=0,\"\",IF(Survey!$F$54=\"N/A\",'MASTER SCOPES'!$E$84,IF(Survey!$F$54=\"YES\",'MASTER SCOPES'!$E$83,IF(Survey!$F$54=\"NO\",'MASTER SCOPES'!$E$85,\"\"))))","v":0}]
[20,{"$f":"IF(Survey!$F$56=0,\"\",IF(Survey!$F$56=\"N/A\",'MASTER SCOPES'!$E$88,IF(Survey!$F$56=\"ND\",'MASTER SCOPES'!$E$89,IF(Survey!$F$56=\"D\",'MASTER SCOPES'!$E$87))))","v":""}]
[21,{"$f":"IF(Survey!$F$58=0,\"\",IF(Survey!$F$58=\"N/A\",\"\",IF(Survey!$F$58<1.25,'MASTER SCOPES'!$E$92,'MASTER SCOPES'!$E$91)))","v":""}]
[22,{"$f":"IF(Survey!$F$60=0,\"\",IF(Survey!$F$60=\"N/A\",'MASTER SCOPES'!$E$95,IF(Survey!$F$60=\"YES\",'MASTER SCOPES'!$E$94,'MASTER SCOPES'!$E$96)))","v":0}]
[8,{"$f":"IF(Survey!$J$73=0,\"\",IF(Survey!$J$73=\"N/A\",'MASTER SCOPES'!$E$99,IF(OR(Survey!$J$73=\"NW\",Survey!$J$73=\"RS\"),'MASTER SCOPES'!$E$98,IF(Survey!$J$73=\"NO\",'MASTER SCOPES'!$E$100,\"\"))))","v":""}]
[]
[null,"ROOFTOP UNIT TWO"]
[]
[1,{"$f":"IF(Survey!$N$18=\"N/A\",[1]MASTERSCOPES!$E$7,IF(Survey!$N$18=\"NO\",'MASTER SCOPES'!$E$6,IF(AND(Survey!$N$18=\"YES\",$J$6>75),'MASTER SCOPES'!$J$7,IF(AND(Survey!$N$18=\"YES\",$J$6<=75),'MASTER SCOPES'!$E$9,\"\"))))","v":""}]
[2,{"$f":"IF(Survey!$N$20=0,\"\",IF(Survey!$N$20=\"N/A\",[1]MASTERSCOPES!$E$13,IF(Survey!$N$20<50,'MASTER SCOPES'!$E$12,IF(Survey!$N$20>=50,'MASTER SCOPES'!$E$11,\"\"))))","v":""}]
[3,{"$f":"IF(Survey!$N$22=0,\"\",IF(Survey!$N$22=\"N/A\",'MASTER SCOPES'!$E$17,IF(Survey!$N$22=\"N/A\",'MASTER SCOPES'!$E$18,IF(Survey!$N$22=\"YES\",'MASTER SCOPES'!$E$18,IF(AND(OR('HVAC SCOPE'!$K$5=\"NC\",'HVAC SCOPE'!$K$5=\"IA\",'HVAC SCOPE'!$K$5=\"MN\",'HVAC SCOPE'!$K$5=\"TX\",'HVAC SCOPE'!$K$5=\"AR\",'HVAC SCOPE'!$K$5=\"MO\",'HVAC SCOPE'!$K$5=\"KS\",'HVAC SCOPE'!$K$5=\"NEB\",'HVAC SCOPE'!$K$5-\"SD\"),Survey!$F$22=\"NO\"),'MASTER SCOPES'!$E$15,'MASTER SCOPES'!$E$16)))))","v":""}]
[4,{"$f":"IF(Survey!$N$24=0,\"\",IF(Survey!$N$24=\"N/A\",'MASTER SCOPES'!$E$22,IF(Survey!$N$24<50,'MASTER SCOPES'!$E$12,IF(Survey!$N$24>=50,'MASTER SCOPES'!$E$20,\"\"))))","v":""}]
[5,{"$f":"IF(Survey!$N$26=\"N/A\",'MASTER SCOPES'!$E$25,IF(Survey!$N$26=0,\"\",IF(Survey!$N$26=\"YES\",'MASTER SCOPES'!$E$24,IF(Survey!$N$26=\"NO\",'MASTER SCOPES'!$E$26,\"\"))))","v":0}]
[6,{"$f":"IF(Survey!$N$28=\"N/A\",'MASTER SCOPES'!$E$29,IF(Survey!$N$28=\"NO\",'MASTER SCOPES'!$E$30,IF(Survey!$N$28=\"YES\",'MASTER SCOPES'!$E$28,\"\")))","v":""}]
[7,{"$f":"IF(Survey!$N$30=\"N/A\",'MASTER SCOPES'!$E$33,IF(Survey!$N$30=\"YES\",'MASTER SCOPES'!$E$32,IF(Survey!$N$30=\"NO\",'MASTER SCOPES'!$E$34,\"\")))","v":""}]
[8,{"$f":"IF(Survey!$N$32=0,\"\",IF(Survey!$N$32=\"N/A\",'MASTER SCOPES'!$E$37,IF(Survey!$N$32=\"YES\",'MASTER SCOPES'!$E$36,IF(AND(Survey!$N$32=\"NO\",Survey!$AA$10=\"Lennox\"),'MASTER SCOPES'!$E$38,IF(AND(Survey!$N$32=\"NO\",Survey!$AA$10=\"Trane\"),'MASTER SCOPES'!$E$39)))))","v":""}]
[9,{"$f":"IF(Survey!$N$34=0,\"\",IF(Survey!$N$34=\"N/A\",'MASTER SCOPES'!$E$42,IF(Survey!$N$34=\"NO\",'MASTER SCOPES'!$E$43,'MASTER SCOPES'!$E$41)))","v":""}]
[10,{"$f":"IF(Survey!$N$36=\"N/A\",'MASTER SCOPES'!$E$46,IF(Survey!$N$36=\"NO\",'MASTER SCOPES'!$E$47,IF(Survey!$N$36=\"YES\",'MASTER SCOPES'!$E$45,\"\")))","v":""}]
[11,{"$f":"IF(Survey!$N$38=\"N/A\",'MASTER SCOPES'!$E$50,IF(Survey!$N$38=\"YES\",'MASTER SCOPES'!$E$49,IF(Survey!$N$38=\"NO\",'MASTER SCOPES'!$E$51,\"\")))","v":""}]
[12,{"$f":"IF(Survey!$N$40=\"N/A\",'MASTER SCOPES'!$E$54,IF(Survey!$N$40=\"YES\",'MASTER SCOPES'!$E$53,IF(Survey!$N$40=\"NO\",'MASTER SCOPES'!$E$51,\"\")))","v":""}]
[13,{"$f":"IF(Survey!$N$42=0,\"\",IF(Survey!$N$42=\"N/A\",'MASTER SCOPES'!$E$59,IF(Survey!$N$42=\"NO\",'MASTER SCOPES'!$E$60,IF(AND(Survey!$N$42=\"YES\",'HVAC SCOPE'!J58>85),'MASTER SCOPES'!$E$57,'MASTER SCOPES'!$E$58))))","v":""}]
[14,{"$f":"IF(Survey!$N$44=0,\"\",IF(Survey!$N$44=\"N/A\",'MASTER SCOPES'!$E$63,IF(Survey!$N$44=\"NO\",'MASTER SCOPES'!$E$64,IF(Survey!$F$44=\"M\",'MASTER SCOPES'!$E$65,'MASTER SCOPES'!$E$62))))","v":0}]
[15,{"$f":"IF(Survey!$N$46=0,\"\",IF(Survey!$N$46=\"N/A\",'MASTER SCOPES'!$E$68,IF(Survey!$N$46=\"I\",'MASTER SCOPES'!$E$67,IF(Survey!$N$46=\"D\",'MASTER SCOPES'!$E$69,'MASTER SCOPES'!$E$67))))","v":""}]
[16,{"$f":"IF(Survey!$N$48=0,\"\",IF(Survey!$N$48=\"N/A\",'MASTER SCOPES'!$E$73,IF(Survey!$N$48=\"YES\",'MASTER SCOPES'!$E$71,IF(Survey!$N$48=\"NO\",'MASTER SCOPES'!E$72,\"\"))))","v":""}]
[17,{"$f":"IF(Survey!$N$50=0,\"\",IF(Survey!$N$50=\"N/A\",'MASTER SCOPES'!$E$76,IF(Survey!$N$50=\"D\",'MASTER SCOPES'!$E$75,IF(Survey!$F$50=\"S\",'MASTER SCOPES'!$E$77,\"\"))))","v":""}]
[18,{"$f":"IF(Survey!$N$52=0,\"\",IF(Survey!$N$52=\"N/A\",'MASTER SCOPES'!$E$80,IF(Survey!$N$52=\"YES\",'MASTER SCOPES'!$E$79,IF(OR(Survey!$N$52=\"NO\",Survey!$N$52=\"D\"),'MASTER SCOPES'!$E$81))))","v":""}]
[19,{"$f":"IF(Survey!$N$54=0,\"\",IF(Survey!$N$54=\"N/A\",'MASTER SCOPES'!$E$84,IF(Survey!$N$54=\"YES\",'MASTER SCOPES'!$E$83,IF(Survey!$F$54=\"NO\",'MASTER SCOPES'!$E$85,\"\"))))","v":""}]
[20,{"$f":"IF(Survey!$N$56=0,\"\",IF(Survey!$N$56=\"N/A\",'MASTER SCOPES'!$E$88,IF(Survey!$N$56=\"ND\",'MASTER SCOPES'!$E$89,IF(Survey!$N$56=\"D\",'MASTER SCOPES'!$E$87))))","v":""}]
[21,{"$f":"IF(Survey!$N$58=0,\"\",IF(Survey!$N$58=\"N/A\",\"\",IF(Survey!$N$58<1.25,'MASTER SCOPES'!$E$92,'MASTER SCOPES'!$E$91)))","v":""}]
[22,{"$f":"IF(Survey!$F$60=0,\"\",IF(Survey!$F$60=\"N/A\",'MASTER SCOPES'!$E$95,IF(Survey!$F$60=\"YES\",'MASTER SCOPES'!$E$94,'MASTER SCOPES'!$E$96)))","v":0}]
[8,{"$f":"IF(Survey!$Z$73=0,\"\",IF(Survey!$Z$73=\"N/A\",'MASTER SCOPES'!$E$99,IF(OR(Survey!$Z$73=\"NW\",Survey!$Z$73=\"RS\"),'MASTER SCOPES'!$E$98,IF(Survey!$Z$73=\"NO\",'MASTER SCOPES'!$E$100,\"\"))))","v":""}]
[]
[null,"ROOFTOP UNIT THREE"]
[]
[1,{"$f":"IF(Survey!$V$18=\"N/A\",[1]MASTERSCOPES!$E$7,IF(Survey!$V$18=\"NO\",'MASTER SCOPES'!$E$6,IF(AND(Survey!$V$18=\"YES\",$J$6>75),'MASTER SCOPES'!$J$7,IF(AND(Survey!$V$18=\"YES\",$J$6<=75),'MASTER SCOPES'!$E$9,\"\"))))","v":""}]
[2,{"$f":"IF(Survey!$V$20=0,\"\",IF(Survey!$V$20=\"N/A\",[1]MASTERSCOPES!$E$13,IF(Survey!$V$20<50,'MASTER SCOPES'!$E$12,IF(Survey!$V$20>=50,'MASTER SCOPES'!$E$11,\"\"))))","v":""}]
[3,{"$f":"IF(Survey!$V$22=0,\"\",IF(Survey!$V$22=\"N/A\",'MASTER SCOPES'!$E$17,IF(Survey!$V$22=\"N/A\",'MASTER SCOPES'!$E$18,IF(Survey!$V$22=\"YES\",'MASTER SCOPES'!$E$18,IF(AND(OR('HVAC SCOPE'!$K$5=\"NC\",'HVAC SCOPE'!$K$5=\"IA\",'HVAC SCOPE'!$K$5=\"MN\",'HVAC SCOPE'!$K$5=\"TX\",'HVAC SCOPE'!$K$5=\"AR\",'HVAC SCOPE'!$K$5=\"MO\",'HVAC SCOPE'!$K$5=\"KS\",'HVAC SCOPE'!$K$5=\"NEB\",'HVAC SCOPE'!$K$5-\"SD\"),Survey!$F$22=\"NO\"),'MASTER SCOPES'!$E$15,'MASTER SCOPES'!$E$16)))))","v":""}]
[4,{"$f":"IF(Survey!$V$24=0,\"\",IF(Survey!$V$24=\"N/A\",'MASTER SCOPES'!$E$22,IF(Survey!$V$24<50,'MASTER SCOPES'!$E$12,IF(Survey!$V$24>=50,'MASTER SCOPES'!$E$20,\"\"))))","v":""}]
[5,{"$f":"IF(Survey!$V$26=\"N/A\",'MASTER SCOPES'!$E$25,IF(Survey!$V$26=0,\"\",IF(Survey!$V$26=\"YES\",'MASTER SCOPES'!$E$24,IF(Survey!$V$26=\"NO\",'MASTER SCOPES'!$E$26,\"\"))))","v":""}]
[6,{"$f":"IF(Survey!$V$28=\"N/A\",'MASTER SCOPES'!$E$29,IF(Survey!$V$28=\"NO\",'MASTER SCOPES'!$E$30,IF(Survey!$V$28=\"YES\",'MASTER SCOPES'!$E$28,\"\")))","v":""}]
[7,{"$f":"IF(Survey!$V$30=\"N/A\",'MASTER SCOPES'!$E$33,IF(Survey!$V$30=\"YES\",'MASTER SCOPES'!$E$32,IF(Survey!$V$30=\"NO\",'MASTER SCOPES'!$E$34,\"\")))","v":""}]
[8,{"$f":"IF(Survey!$V$32=0,\"\",IF(Survey!$V$32=\"N/A\",'MASTER SCOPES'!$E$37,IF(Survey!$V$32=\"YES\",'MASTER SCOPES'!$E$36,IF(AND(Survey!$V$32=\"NO\",Survey!$AA$12=\"Lennox\"),'MASTER SCOPES'!$E$38,IF(AND(Survey!$V$32=\"NO\",Survey!$AA$12=\"Trane\"),'MASTER SCOPES'!$E$39)))))","v":""}]
[9,{"$f":"IF(Survey!$V$34=0,\"\",IF(Survey!$V$34=\"N/A\",'MASTER SCOPES'!$E$42,IF(Survey!$AD$34=\"NO\",'MASTER SCOPES'!$E$43,'MASTER SCOPES'!$E$41)))","v":""}]
[10,{"$f":"IF(Survey!$V$36=\"N/A\",'MASTER SCOPES'!$E$46,IF(Survey!$V$36=\"NO\",'MASTER SCOPES'!$E$47,IF(Survey!$V$36=\"YES\",'MASTER SCOPES'!$E$45,\"\")))","v":""}]
[11,{"$f":"IF(Survey!$V$38=\"N/A\",'MASTER SCOPES'!$E$50,IF(Survey!$V$38=\"YES\",'MASTER SCOPES'!$E$49,IF(Survey!$V$38=\"NO\",'MASTER SCOPES'!$E$51,\"\")))","v":""}]
[12,{"$f":"IF(Survey!$V$40=\"N/A\",'MASTER SCOPES'!$E$54,IF(Survey!$V$40=\"YES\",'MASTER SCOPES'!$E$53,IF(Survey!$V$40=\"NO\",'MASTER SCOPES'!$E$51,\"\")))","v":""}]
[13,{"$f":"IF(Survey!$V$42=0,\"\",IF(Survey!$V$42=\"N/A\",'MASTER SCOPES'!$E$59,IF(Survey!$V$42=\"NO\",'MASTER SCOPES'!$E$60,IF(AND(Survey!$V$42=\"YES\",'HVAC SCOPE'!J32>85),'MASTER SCOPES'!$E$57,'MASTER SCOPES'!$E$58))))","v":""}]
[14,{"$f":"IF(Survey!$V$44=0,\"\",IF(Survey!$V$44=\"N/A\",'MASTER SCOPES'!$E$63,IF(Survey!$V$44=\"NO\",'MASTER SCOPES'!$E$64,IF(Survey!$V$44=\"M\",'MASTER SCOPES'!$E$65,'MASTER SCOPES'!$E$62))))","v":""}]
[15,{"$f":"IF(Survey!$V$46=0,\"\",IF(Survey!$V$46=\"N/A\",'MASTER SCOPES'!$E$68,IF(Survey!$V$46=\"I\",'MASTER SCOPES'!$E$67,IF(Survey!$V$46=\"D\",'MASTER SCOPES'!$E$69,'MASTER SCOPES'!$E$67))))","v":""}]
[16,{"$f":"IF(Survey!$V$48=0,\"\",IF(Survey!$V$48=\"N/A\",'MASTER SCOPES'!$E$73,IF(Survey!$V$48=\"YES\",'MASTER SCOPES'!$E$71,IF(Survey!$V$48=\"NO\",'MASTER SCOPES'!E$72,\"\"))))","v":""}]
[17,{"$f":"IF(Survey!$V$50=0,\"\",IF(Survey!$V$50=\"N/A\",'MASTER SCOPES'!$E$76,IF(Survey!$V$50=\"D\",'MASTER SCOPES'!$E$75,IF(Survey!$V$50=\"S\",'MASTER SCOPES'!$E$77,\"\"))))","v":""}]
[18,{"$f":"IF(Survey!$V$52=0,\"\",IF(Survey!$V$52=\"N/A\",'MASTER SCOPES'!$E$80,IF(Survey!$V$52=\"YES\",'MASTER SCOPES'!$E$79,IF(OR(Survey!$V$52=\"NO\",Survey!$V$52=\"D\"),'MASTER SCOPES'!$E$81))))","v":""}]
[19,{"$f":"IF(Survey!$V$54=0,\"\",IF(Survey!$V$54=\"N/A\",'MASTER SCOPES'!$E$84,IF(Survey!$V$54=\"YES\",'MASTER SCOPES'!$E$83,IF(Survey!$V$54=\"NO\",'MASTER SCOPES'!$E$85,\"\"))))","v":""}]
[20,{"$f":"IF(Survey!$V$56=0,\"\",IF(Survey!$V$56=\"N/A\",'MASTER SCOPES'!$E$88,IF(Survey!$V$56=\"ND\",'MASTER SCOPES'!$E$89,IF(Survey!$V$56=\"D\",'MASTER SCOPES'!$E$87))))","v":""}]
[21,{"$f":"IF(Survey!$V$58=0,\"\",IF(Survey!$V$58=\"N/A\",\"\",IF(Survey!$V$58<1.25,'MASTER SCOPES'!$E$92,'MASTER SCOPES'!$E$91)))","v":""}]
[22,{"$f":"IF(Survey!$V$60=0,\"\",IF(Survey!$V$60=\"N/A\",'MASTER SCOPES'!$E$95,IF(Survey!$V$60=\"YES\",'MASTER SCOPES'!$E$94,'MASTER SCOPES'!$E$96)))","v":""}]
[8,{"$f":"IF(Survey!$AP$73=0,\"\",IF(Survey!$AP$73=\"N/A\",'MASTER SCOPES'!$E$99,IF(OR(Survey!$AP$73=\"NW\",Survey!$AP$73=\"RS\"),'MASTER SCOPES'!$E$98,IF(Survey!$AP$73=\"NO\",'MASTER SCOPES'!$E$100,\"\"))))","v":""}]
[]
[null,"ROOFTOP UNIT FOUR"]
[]
[1,{"$f":"IF(Survey!$AD$18=\"N/A\",[1]MASTERSCOPES!$E$7,IF(Survey!$AD$18=\"NO\",'MASTER SCOPES'!$E$6,IF(AND(Survey!$AD$18=\"YES\",$J$6>75),'MASTER SCOPES'!$J$7,IF(AND(Survey!$AD$18=\"YES\",$J$6<=75),'MASTER SCOPES'!$E$9,\"\"))))","v":""}]
[2,{"$f":"IF(Survey!$AD$20=0,\"\",IF(Survey!$AD$20=\"N/A\",[1]MASTERSCOPES!$E$13,IF(Survey!$AD$20<50,'MASTER SCOPES'!$E$12,IF(Survey!$AD$20>=50,'MASTER SCOPES'!$E$11,\"\"))))","v":""}]
[3,{"$f":"IF(Survey!$AD$22=0,\"\",IF(Survey!$AD$22=\"N/A\",'MASTER SCOPES'!$E$17,IF(Survey!$AD$22=\"N/A\",'MASTER SCOPES'!$E$18,IF(Survey!$AD$22=\"YES\",'MASTER SCOPES'!$E$18,IF(AND(OR('HVAC SCOPE'!$K$5=\"NC\",'HVAC SCOPE'!$K$5=\"IA\",'HVAC SCOPE'!$K$5=\"MN\",'HVAC SCOPE'!$K$5=\"TX\",'HVAC SCOPE'!$K$5=\"AR\",'HVAC SCOPE'!$K$5=\"MO\",'HVAC SCOPE'!$K$5=\"KS\",'HVAC SCOPE'!$K$5=\"NEB\",'HVAC SCOPE'!$K$5-\"SD\"),Survey!$F$22=\"NO\"),'MASTER SCOPES'!$E$15,'MASTER SCOPES'!$E$16)))))","v":""}]
[4,{"$f":"IF(Survey!$AD$24=0,\"\",IF(Survey!$AD$24=\"N/A\",'MASTER SCOPES'!$E$22,IF(Survey!$AD$24<50,'MASTER SCOPES'!$E$12,IF(Survey!$AD$24>=50,'MASTER SCOPES'!$E$20,\"\"))))","v":""}]
[5,{"$f":"IF(Survey!$AD$26=\"N/A\",'MASTER SCOPES'!$E$25,IF(Survey!$AD$26=0,\"\",IF(Survey!$AD$26=\"YES\",'MASTER SCOPES'!$E$24,IF(Survey!$AD$26=\"NO\",'MASTER SCOPES'!$E$26,\"\"))))","v":0}]
[6,{"$f":"IF(Survey!$AD$28=\"N/A\",'MASTER SCOPES'!$E$29,IF(Survey!$AD$28=\"NO\",'MASTER SCOPES'!$E$30,IF(Survey!$AD$28=\"YES\",'MASTER SCOPES'!$E$28,\"\")))","v":""}]
[7,{"$f":"IF(Survey!$AD$30=\"N/A\",'MASTER SCOPES'!$E$33,IF(Survey!$AD$30=\"YES\",'MASTER SCOPES'!$E$32,IF(Survey!$AD$30=\"NO\",'MASTER SCOPES'!$E$34,\"\")))","v":""}]
[8,{"$f":"IF(Survey!$AD$32=0,\"\",IF(Survey!$AD$32=\"N/A\",'MASTER SCOPES'!$E$37,IF(Survey!$AD$32=\"YES\",'MASTER SCOPES'!$E$36,IF(AND(Survey!$AD$32=\"NO\",Survey!$AA$11=\"Lennox\"),'MASTER SCOPES'!$E$38,IF(AND(Survey!$AD$32=\"NO\",Survey!$AA$11=\"Trane\"),'MASTER SCOPES'!$E$39)))))","v":""}]
[9,{"$f":"IF(Survey!$AD$34=0,\"\",IF(Survey!$AD$34=\"N/A\",'MASTER SCOPES'!$E$42,IF(Survey!$AD$34=\"NO\",'MASTER SCOPES'!$E$43,'MASTER SCOPES'!$E$41)))","v":""}]
[10,{"$f":"IF(Survey!$AD$36=\"N/A\",'MASTER SCOPES'!$E$46,IF(Survey!$AD$36=\"NO\",'MASTER SCOPES'!$E$47,IF(Survey!$AD$36=\"YES\",'MASTER SCOPES'!$E$45,\"\")))","v":""}]
[11,{"$f":"IF(Survey!$AD$38=\"N/A\",'MASTER SCOPES'!$E$50,IF(Survey!$AD$38=\"YES\",'MASTER SCOPES'!$E$49,IF(Survey!$AD$38=\"NO\",'MASTER SCOPES'!$E$51,\"\")))","v":""}]
[12,{"$f":"IF(Survey!$AD$40=\"N/A\",'MASTER SCOPES'!$E$54,IF(Survey!$AD$40=\"YES\",'MASTER SCOPES'!$E$53,IF(Survey!$AD$40=\"NO\",'MASTER SCOPES'!$E$51,\"\")))","v":""}]
[13,{"$f":"IF(Survey!$AD$42=0,\"\",IF(Survey!$AD$42=\"N/A\",'MASTER SCOPES'!$E$59,IF(Survey!$AD$42=\"NO\",'MASTER SCOPES'!$E$60,IF(AND(Survey!$AD$42=\"YES\",'HVAC SCOPE'!J58>85),'MASTER SCOPES'!$E$57,'MASTER SCOPES'!$E$58))))","v":""}]
[14,{"$f":"IF(Survey!$AD$44=0,\"\",IF(Survey!$AD$44=\"N/A\",'MASTER SCOPES'!$E$63,IF(Survey!$AD$44=\"NO\",'MASTER SCOPES'!$E$64,IF(Survey!$AD$44=\"M\",'MASTER SCOPES'!$E$65,'MASTER SCOPES'!$E$62))))","v":0}]
[15,{"$f":"IF(Survey!$AD$46=0,\"\",IF(Survey!$AD$46=\"N/A\",'MASTER SCOPES'!$E$68,IF(Survey!$AD$46=\"I\",'MASTER SCOPES'!$E$67,IF(Survey!$AD$46=\"D\",'MASTER SCOPES'!$E$69,'MASTER SCOPES'!$E$67))))","v":""}]
[16,{"$f":"IF(Survey!$AD$48=0,\"\",IF(Survey!$AD$48=\"N/A\",'MASTER SCOPES'!$E$73,IF(Survey!$AD$48=\"YES\",'MASTER SCOPES'!$E$71,IF(Survey!$AD$48=\"NO\",'MASTER SCOPES'!E$72,\"\"))))","v":""}]
[17,{"$f":"IF(Survey!$AD$50=0,\"\",IF(Survey!$AD$50=\"N/A\",'MASTER SCOPES'!$E$76,IF(Survey!$AD$50=\"D\",'MASTER SCOPES'!$E$75,IF(Survey!$AD$50=\"S\",'MASTER SCOPES'!$E$77,\"\"))))","v":""}]
[18,{"$f":"IF(Survey!$AD$52=0,\"\",IF(Survey!$AD$52=\"N/A\",'MASTER SCOPES'!$E$80,IF(Survey!$AD$52=\"YES\",'MASTER SCOPES'!$E$79,IF(OR(Survey!$AD$52=\"NO\",Survey!$AD$52=\"D\"),'MASTER SCOPES'!$E$81))))","v":""}]
[19,{"$f":"IF(Survey!$AD$54=0,\"\",IF(Survey!$AD$54=\"N/A\",'MASTER SCOPES'!$E$84,IF(Survey!$AD$54=\"YES\",'MASTER SCOPES'!$E$83,IF(Survey!$AD$54=\"NO\",'MASTER SCOPES'!$E$85,\"\"))))","v":""}]
[20,{"$f":"IF(Survey!$AD$56=0,\"\",IF(Survey!$AD$56=\"N/A\",'MASTER SCOPES'!$E$88,IF(Survey!$AD$56=\"ND\",'MASTER SCOPES'!$E$89,IF(Survey!$AD$56=\"D\",'MASTER SCOPES'!$E$87))))","v":""}]
[21,{"$f":"IF(Survey!$AD$58=0,\"\",IF(Survey!$AD$58=\"N/A\",\"\",IF(Survey!$AD$58<1.25,'MASTER SCOPES'!$E$92,'MASTER SCOPES'!$E$91)))","v":""}]
[22,{"$f":"IF(Survey!$AD$60=0,\"\",IF(Survey!$AD$60=\"N/A\",'MASTER SCOPES'!$E$95,IF(Survey!$AD$60=\"YES\",'MASTER SCOPES'!$E$94,'MASTER SCOPES'!$E$96)))","v":""}]
[8,{"$f":"IF(Survey!$BF$73=0,\"\",IF(Survey!$BF$73=\"N/A\",'MASTER SCOPES'!$E$99,IF(OR(Survey!$BF$73=\"NW\",Survey!$BF$73=\"RS\"),'MASTER SCOPES'!$E$98,IF(Survey!$BF$73=\"NO\",'MASTER SCOPES'!$E$100,\"\"))))","v":"No action required."}]
[]
[null,"ROOFTOP UNIT FIVE"]
[]
[1,{"$f":"IF(Survey!$AL$18=\"N/A\",[1]MASTERSCOPES!$E$7,IF(Survey!$AL$18=\"NO\",'MASTER SCOPES'!$E$6,IF(AND(Survey!$AL$18=\"YES\",$J$6>75),'MASTER SCOPES'!$J$7,IF(AND(Survey!$AL$18=\"YES\",$J$6<=75),'MASTER SCOPES'!$E$9,\"\"))))","v":""}]
[2,{"$f":"IF(Survey!$AL$20=0,\"\",IF(Survey!$AL$20=\"N/A\",[1]MASTERSCOPES!$E$13,IF(Survey!$AL$20<50,'MASTER SCOPES'!$E$12,IF(Survey!$AL$20>=50,'MASTER SCOPES'!$E$11,\"\"))))","v":""}]
[3,{"$f":"IF(Survey!$AL$22=0,\"\",IF(Survey!$AL$22=\"N/A\",'MASTER SCOPES'!$E$17,IF(Survey!$AL$22=\"N/A\",'MASTER SCOPES'!$E$18,IF(Survey!$AL$22=\"YES\",'MASTER SCOPES'!$E$18,IF(AND(OR('HVAC SCOPE'!$K$5=\"NC\",'HVAC SCOPE'!$K$5=\"IA\",'HVAC SCOPE'!$K$5=\"MN\",'HVAC SCOPE'!$K$5=\"TX\",'HVAC SCOPE'!$K$5=\"AR\",'HVAC SCOPE'!$K$5=\"MO\",'HVAC SCOPE'!$K$5=\"KS\",'HVAC SCOPE'!$K$5=\"NEB\",'HVAC SCOPE'!$K$5-\"SD\"),Survey!$F$22=\"NO\"),'MASTER SCOPES'!$E$15,'MASTER SCOPES'!$E$16)))))","v":""}]
[4,{"$f":"IF(Survey!$AL$24=0,\"\",IF(Survey!$AL$24=\"N/A\",'MASTER SCOPES'!$E$22,IF(Survey!$AL$24<50,'MASTER SCOPES'!$E$12,IF(Survey!$AL$24>=50,'MASTER SCOPES'!$E$11,\"\"))))","v":""}]
[5,{"$f":"IF(Survey!$AL$26=\"N/A\",'MASTER SCOPES'!$E$25,IF(Survey!$AL$26=0,\"\",IF(Survey!$AL$26=\"YES\",'MASTER SCOPES'!$E$24,IF(Survey!$AL$26=\"NO\",'MASTER SCOPES'!$E$26,\"\"))))","v":""}]
[6,{"$f":"IF(Survey!$AL$28=\"N/A\",'MASTER SCOPES'!$E$29,IF(Survey!$AL$28=\"NO\",'MASTER SCOPES'!$E$30,IF(Survey!$AL$28=\"YES\",'MASTER SCOPES'!$E$28,\"\")))","v":""}]
[7,{"$f":"IF(Survey!$AL$30=\"N/A\",'MASTER SCOPES'!$E$33,IF(Survey!$AL$30=\"YES\",'MASTER SCOPES'!$E$32,IF(Survey!$AL$30=\"NO\",'MASTER SCOPES'!$E$34,\"\")))","v":""}]
[8,{"$f":"IF(Survey!$AL$32=0,\"\",IF(Survey!$AL$32=\"N/A\",'MASTER SCOPES'!$E$37,IF(Survey!$AL$32=\"YES\",'MASTER SCOPES'!$E$36,IF(AND(Survey!$AL$32=\"NO\",Survey!$AA$13=\"Lennox\"),'MASTER SCOPES'!$E$38,IF(AND(Survey!$AL$32=\"NO\",Survey!$AA$13=\"Trane\"),'MASTER SCOPES'!$E$39)))))","v":false}]
[9,{"$f":"IF(Survey!$AL$34=0,\"\",IF(Survey!$AL$34=\"N/A\",'MASTER SCOPES'!$E$42,IF(Survey!$AL$34=\"NO\",'MASTER SCOPES'!$E$43,'MASTER SCOPES'!$E$41)))","v":""}]
[10,{"$f":"IF(Survey!$AL$36=\"N/A\",'MASTER SCOPES'!$E$46,IF(Survey!$AL$36=\"NO\",'MASTER SCOPES'!$E$47,IF(Survey!$AL$36=\"YES\",'MASTER SCOPES'!$E$45,\"\")))","v":""}]
[11,{"$f":"IF(Survey!$AL$38=\"N/A\",'MASTER SCOPES'!$E$50,IF(Survey!$AL$38=\"YES\",'MASTER SCOPES'!$E$49,IF(Survey!$AL$38=\"NO\",'MASTER SCOPES'!$E$51,\"\")))","v":""}]
[12,{"$f":"IF(Survey!$AL$40=\"N/A\",'MASTER SCOPES'!$E$54,IF(Survey!$AL$40=\"YES\",'MASTER SCOPES'!$E$53,IF(Survey!$AL$40=\"NO\",'MASTER SCOPES'!$E$51,\"\")))","v":""}]
[13,{"$f":"IF(Survey!$AL$42=0,\"\",IF(Survey!$AL$42=\"N/A\",'MASTER SCOPES'!$E$59,IF(Survey!$AL$42=\"NO\",'MASTER SCOPES'!$E$60,IF(AND(Survey!$AL$42=\"YES\",'HVAC SCOPE'!BV6>85),'MASTER SCOPES'!$E$57,'MASTER SCOPES'!$E$58))))","v":""}]
[14,{"$f":"IF(Survey!$AL$44=0,\"\",IF(Survey!$AL$44=\"N/A\",'MASTER SCOPES'!$E$63,IF(Survey!$AL$44=\"NO\",'MASTER SCOPES'!$E$64,IF(Survey!$AL$44=\"M\",'MASTER SCOPES'!$E$65,'MASTER SCOPES'!$E$62))))","v":""}]
[15,{"$f":"IF(Survey!$AL$46=0,\"\",IF(Survey!$AL$46=\"N/A\",'MASTER SCOPES'!$E$68,IF(Survey!$AL$46=\"I\",'MASTER SCOPES'!$E$67,IF(Survey!$AL$46=\"D\",'MASTER SCOPES'!$E$69,'MASTER SCOPES'!$E$67))))","v":""}]
[16,{"$f":"IF(Survey!$AL$48=0,\"\",IF(Survey!$AL$48=\"N/A\",'MASTER SCOPES'!$E$73,IF(Survey!$AL$48=\"YES\",'MASTER SCOPES'!$E$71,IF(Survey!$AL$48=\"NO\",'MASTER SCOPES'!E$72,\"\"))))","v":""}]
[17,{"$f":"IF(Survey!$AL$50=0,\"\",IF(Survey!$AL$50=\"N/A\",'MASTER SCOPES'!$E$76,IF(Survey!$AL$50=\"D\",'MASTER SCOPES'!$E$75,IF(Survey!$AL$50=\"S\",'MASTER SCOPES'!$E$77,\"\"))))","v":""}]
[18,{"$f":"IF(Survey!$AL$52=0,\"\",IF(Survey!$AL$52=\"N/A\",'MASTER SCOPES'!$E$80,IF(Survey!$AL$52=\"YES\",'MASTER SCOPES'!$E$79,IF(OR(Survey!$AL$52=\"NO\",Survey!$AL$52=\"D\"),'MASTER SCOPES'!$E$81))))","v":""}]
[19,{"$f":"IF(Survey!$AL$54=0,\"\",IF(Survey!$AL$54=\"N/A\",'MASTER SCOPES'!$E$84,IF(Survey!$AL$54=\"YES\",'MASTER SCOPES'!$E$83,IF(Survey!$AL$54=\"NO\",'MASTER SCOPES'!$E$85,\"\"))))","v":""}]
[20,{"$f":"IF(Survey!$AL$56=0,\"\",IF(Survey!$AL$56=\"N/A\",'MASTER SCOPES'!$E$88,IF(Survey!$AL$56=\"ND\",'MASTER SCOPES'!$E$89,IF(Survey!$AL$56=\"D\",'MASTER SCOPES'!$E$87))))","v":""}]
[21,{"$f":"IF(Survey!$AL$58=0,\"\",IF(Survey!$AL$58=\"N/A\",\"\",IF(Survey!$AL$58<1.25,'MASTER SCOPES'!$E$92,'MASTER SCOPES'!$E$91)))","v":""}]
[22,{"$f":"IF(Survey!$AL$60=0,\"\",IF(Survey!$AL$60=\"N/A\",'MASTER SCOPES'!$E$95,IF(Survey!$AL$60=\"YES\",'MASTER SCOPES'!$E$94,'MASTER SCOPES'!$E$96)))","v":""}]
[8,{"$f":"IF(Survey!$J$74=0,\"\",IF(Survey!$J$74=\"N/A\",'MASTER SCOPES'!$E$99,IF(OR(Survey!$J$74=\"NW\",Survey!$J$74=\"RS\"),'MASTER SCOPES'!$E$98,IF(Survey!$J$74=\"NO\",'MASTER SCOPES'!$E$100,\"\"))))","v":""}]
[]
[null,"ROOFTOP UNIT SIX"]
[]
[1,{"$f":"IF(Survey!$AL$18=\"N/A\",[1]MASTERSCOPES!$E$7,IF(Survey!$AL$18=\"NO\",'MASTER SCOPES'!$E$6,IF(AND(Survey!$AL$18=\"YES\",$J$6>75),'MASTER SCOPES'!$J$7,IF(AND(Survey!$AL$18=\"YES\",$J$6<=75),'MASTER SCOPES'!$E$9,\"\"))))","v":""}]
[2,{"$f":"IF(Survey!$AL$20=0,\"\",IF(Survey!$AL$20=\"N/A\",[1]MASTERSCOPES!$E$13,IF(Survey!$AL$20<50,'MASTER SCOPES'!$E$12,IF(Survey!$AL$20>=50,'MASTER SCOPES'!$E$11,\"\"))))","v":""}]
[3,{"$f":"IF(Survey!$AL$22=0,\"\",IF(Survey!$AL$22=\"N/A\",'MASTER SCOPES'!$E$17,IF(Survey!$AL$22=\"N/A\",'MASTER SCOPES'!$E$18,IF(Survey!$AL$22=\"YES\",'MASTER SCOPES'!$E$18,IF(AND(OR('HVAC SCOPE'!$K$5=\"NC\",'HVAC SCOPE'!$K$5=\"IA\",'HVAC SCOPE'!$K$5=\"MN\",'HVAC SCOPE'!$K$5=\"TX\",'HVAC SCOPE'!$K$5=\"AR\",'HVAC SCOPE'!$K$5=\"MO\",'HVAC SCOPE'!$K$5=\"KS\",'HVAC SCOPE'!$K$5=\"NEB\",'HVAC SCOPE'!$K$5-\"SD\"),Survey!$F$22=\"NO\"),'MASTER SCOPES'!$E$15,'MASTER SCOPES'!$E$16)))))","v":""}]
[4,{"$f":"IF(Survey!$AL$24=0,\"\",IF(Survey!$AL$24=\"N/A\",'MASTER SCOPES'!$E$22,IF(Survey!$AL$24<50,'MASTER SCOPES'!$E$12,IF(Survey!$AL$24>=50,'MASTER SCOPES'!$E$11,\"\"))))","v":""}]
[5,{"$f":"IF(Survey!$AL$26=\"N/A\",'MASTER SCOPES'!$E$25,IF(Survey!$AL$26=0,\"\",IF(Survey!$AL$26=\"YES\",'MASTER SCOPES'!$E$24,IF(Survey!$AL$26=\"NO\",'MASTER SCOPES'!$E$26,\"\"))))","v":""}]
[6,{"$f":"IF(Survey!$AL$28=\"N/A\",'MASTER SCOPES'!$E$29,IF(Survey!$AL$28=\"NO\",'MASTER SCOPES'!$E$30,IF(Survey!$AL$28=\"YES\",'MASTER SCOPES'!$E$28,\"\")))","v":""}]
[7,{"$f":"IF(Survey!$AL$30=\"N/A\",'MASTER SCOPES'!$E$33,IF(Survey!$AL$30=\"YES\",'MASTER SCOPES'!$E$32,IF(Survey!$AL$30=\"NO\",'MASTER SCOPES'!$E$34,\"\")))","v":""}]
[8,{"$f":"IF(Survey!$AL$32=0,\"\",IF(Survey!$AL$32=\"N/A\",'MASTER SCOPES'!$E$37,IF(Survey!$AL$32=\"YES\",'MASTER SCOPES'!$E$36,IF(AND(Survey!$AL$32=\"NO\",Survey!$AA$13=\"Lennox\"),'MASTER SCOPES'!$E$38,IF(AND(Survey!$AL$32=\"NO\",Survey!$AA$13=\"Trane\"),'MASTER SCOPES'!$E$39)))))","v":false}]
[9,{"$f":"IF(Survey!$AL$34=0,\"\",IF(Survey!$AL$34=\"N/A\",'MASTER SCOPES'!$E$42,IF(Survey!$AL$34=\"NO\",'MASTER SCOPES'!$E$43,'MASTER SCOPES'!$E$41)))","v":""}]
[10,{"$f":"IF(Survey!$AL$36=\"N/A\",'MASTER SCOPES'!$E$46,IF(Survey!$AL$36=\"NO\",'MASTER SCOPES'!$E$47,IF(Survey!$AL$36=\"YES\",'MASTER SCOPES'!$E$45,\"\")))","v":""}]
[11,{"$f":"IF(Survey!$AL$38=\"N/A\",'MASTER SCOPES'!$E$50,IF(Survey!$AL$38=\"YES\",'MASTER SCOPES'!$E$49,IF(Survey!$AL$38=\"NO\",'MASTER SCOPES'!$E$51,\"\")))","v":""}]
[12,{"$f":"IF(Survey!$AL$40=\"N/A\",'MASTER SCOPES'!$E$54,IF(Survey!$AL$40=\"YES\",'MASTER SCOPES'!$E$53,IF(Survey!$AL$40=\"NO\",'MASTER SCOPES'!$E$51,\"\")))","v":""}]
[13,{"$f":"IF(Survey!$AL$42=0,\"\",IF(Survey!$AL$42=\"N/A\",'MASTER SCOPES'!$E$59,IF(Survey!$AL$42=\"NO\",'MASTER SCOPES'!$E$60,IF(AND(Survey!$AL$42=\"YES\",'HVAC SCOPE'!BV32>85),'MASTER SCOPES'!$E$57,'MASTER SCOPES'!$E$58))))","v":""}]
[14,{"$f":"IF(Survey!$AL$44=0,\"\",IF(Survey!$AL$44=\"N/A\",'MASTER SCOPES'!$E$63,IF(Survey!$AL$44=\"NO\",'MASTER SCOPES'!$E$64,IF(Survey!$AL$44=\"M\",'MASTER SCOPES'!$E$65,'MASTER SCOPES'!$E$62))))","v":""}]
[15,{"$f":"IF(Survey!$AL$46=0,\"\",IF(Survey!$AL$46=\"N/A\",'MASTER SCOPES'!$E$68,IF(Survey!$AL$46=\"I\",'MASTER SCOPES'!$E$67,IF(Survey!$AL$46=\"D\",'MASTER SCOPES'!$E$69,'MASTER SCOPES'!$E$67))))","v":""}]
[16,{"$f":"IF(Survey!$AL$48=0,\"\",IF(Survey!$AL$48=\"N/A\",'MASTER SCOPES'!$E$73,IF(Survey!$AL$48=\"YES\",'MASTER SCOPES'!$E$71,IF(Survey!$AL$48=\"NO\",'MASTER SCOPES'!E$72,\"\"))))","v":""}]
[17,{"$f":"IF(Survey!$AL$50=0,\"\",IF(Survey!$AL$50=\"N/A\",'MASTER SCOPES'!$E$76,IF(Survey!$AL$50=\"D\",'MASTER SCOPES'!$E$75,IF(Survey!$AL$50=\"S\",'MASTER SCOPES'!$E$77,\"\"))))","v":""}]
[18,{"$f":"IF(Survey!$AL$52=0,\"\",IF(Survey!$AL$52=\"N/A\",'MASTER SCOPES'!$E$80,IF(Survey!$AL$52=\"YES\",'MASTER SCOPES'!$E$79,IF(OR(Survey!$AL$52=\"NO\",Survey!$AL$52=\"D\"),'MASTER SCOPES'!$E$81))))","v":""}]
[19,{"$f":"IF(Survey!$AL$54=0,\"\",IF(Survey!$AL$54=\"N/A\",'MASTER SCOPES'!$E$84,IF(Survey!$AL$54=\"YES\",'MASTER SCOPES'!$E$83,IF(Survey!$AL$54=\"NO\",'MASTER SCOPES'!$E$85,\"\"))))","v":""}]
[20,{"$f":"IF(Survey!$AL$56=0,\"\",IF(Survey!$AL$56=\"N/A\",'MASTER SCOPES'!$E$88,IF(Survey!$AL$56=\"ND\",'MASTER SCOPES'!$E$89,IF(Survey!$AL$56=\"D\",'MASTER SCOPES'!$E$87))))","v":""}]
[21,{"$f":"IF(Survey!$AL$58=0,\"\",IF(Survey!$AL$58=\"N/A\",\"\",IF(Survey!$AL$58<1.25,'MASTER SCOPES'!$E$92,'MASTER SCOPES'!$E$91)))","v":""}]
[22,{"$f":"IF(Survey!$AL$60=0,\"\",IF(Survey!$AL$60=\"N/A\",'MASTER SCOPES'!$E$95,IF(Survey!$AL$60=\"YES\",'MASTER SCOPES'!$E$94,'MASTER SCOPES'!$E$96)))","v":""}]
[8,{"$f":"IF(Survey!$J$74=0,\"\",IF(Survey!$J$74=\"N/A\",'MASTER SCOPES'!$E$99,IF(OR(Survey!$J$74=\"NW\",Survey!$J$74=\"RS\"),'MASTER SCOPES'!$E$98,IF(Survey!$J$74=\"NO\",'MASTER SCOPES'!$E$100,\"\"))))","v":""}]

{"sheet":"MASTER SCOPES","index":14,"n_rows":121,"n_cols":5,"rows_kept":121,"cut":false,"hidden":true,"merged":[[108,1,109,2],[92,1,92,4],[93,1,95,2],[96,1,96,4],[97,1,99,2],[82,1,84,2],[85,1,85,4],[86,1,88,2],[89,1,89,4],[90,1,91,2],[74,1,76,2],[77,1,77,4],[78,1,80,2],[81,1,81,4],[69,1,69,4],[55,1,55,4],[66,1,68,2],[73,1,73,4],[56,1,59,2],[60,1,60,4],[61,1,64,2],[65,1,65,4],[70,1,72,2],[112,1,112,3],[113,1,113,2],[114,1,114,2],[4,1,4,4],[26,1,26,4],[27,1,29,2],[13,1,13,4],[14,1,17,2],[5,1,8,2],[18,1,18,4],[22,1,22,4],[23,1,25,2],[39,1,39,4],[40,1,42,2],[9,1,9,4],[43,1,43,4],[120,1,120,2],[115,1,115,2],[116,1,116,2],[117,1,117,2],[118,1,118,2],[119,1,119,2],[3,1,3,4],[100,1,100,4],[101,1,102,2],[103,1,105,2],[106,1,107,2],[10,1,12,2],[19,1,21,2],[47,1,47,4],[48,1,50,2],[51,1,51,4],[44,1,46,2],[30,1,30,4],[31,1,33,2],[34,1,34,4],[35,1,38,2],[52,1,54,2]]}
[]
[]
[]
[null,"RTU SCOPES"]
[null,{"$f":"Survey!B17","v":"1.  Using punch/screwdriver, prod heat exchanger tubes.  If holes found and/or prod test fails enter YES, lockout unit and infom management. If not, enter NO."}]
[null,"Survey Response",null,"NO","No action required."]
[null,null,null,"N/A"]
[null,null,null,"YES>=75%","1.  Replace unit."]
[null,null,null,"YES<75%","1.  MC to replace heat exchanger."]
[null,{"$f":"Survey!B19","v":"2.  Quantify damage/deterioration to the condenser coil, and enter value 0% to 100%."}]
[null,"Survey Response",null,">50%","2.  MC to comb coils that are bent and able to be straightened.  If unrepairable damage is > 50% of coil face, follow Unit Replacement Guidelines above."]
[null,null,null,"<50%","No action required."]
[null,null,null,"N/A"]
[null,{"$f":"Survey!B21","v":"3.  Is there a hail guard installed on unit?  Enter YES or NO.  NOTE: If \"CRITICAL\", unit in top ten hail states."}]
[null,"Survey Response",null,"NO (hail state)","3.  MC to purchase and install hailguard for HVAC unit."]
[null,null,null,"NO (not hail state)","3.  MC to purchase and install hailguard for HVAC unit."]
[null,null,null,"N/A"]
[null,null,null,"YES","No action required."]
[null,{"$f":"Survey!B23","v":"4.  Quantify damage/deterioration evaporator coil, and enter value 0% to 100%."}]
[null,"Survey Response",null,">50%","4.  MC to comb coils that are bent and able to be straightened.  If unrepairable damage is > 50% of coil face, follow Unit Replacement Guidelines above."]
[null,null,null,"<50%","No action required."]
[null,null,null,"N/A"]
[null,{"$f":"Survey!B25","v":"5.  Check for power exhaust at AC units greater than ten tons.  If no power exhaust, enter NO.  If there is a power exhaust enter YES"}]
[null,"Survey Response",null,"YES","No action required."]
[null,null,null,"N/A"]
[null,null,null,"NO","5.  If power exhaust fan available, procure after-market part and install.  If power exhaust does NOT exist, MC to contact FC for nex step."]
[null,{"$f":"Survey!B27","v":"6.  Are there curb adaptors on any of the units?  Enter YES or NO."}]
[null,"Survey Response",null,"YES","6.  MC to determine if adapter is an approved adapter.  If not an approved adapter, follow-up evaluation with RTU manufacturer for drive test."]
[null,null,null,"N/A"]
[null,null,null,"NO","No action required."]
[null,{"$f":"Survey!B29","v":"7.  If the unit is a dehumidification type unit,  does it have the humidistat device? If so enter YES or NO."}]
[null,"Survey Response",null,"YES","No action required."]
[null,null,null,"N/A"]
[null,null,null,"NO","7.  MC to purchase and install humidistat and test functionality per the key note specifications for the unit type."]
[null,{"$f":"Survey!B31","v":"8.  If the unit is a dehumidification type unit,  is the wiring correct from the device to the RTU Master Control Board?  If so enter YES or NO.  Lennox = Two separate shielded ComCables; Trane = One shielded two conductor ComCable."}]
[null,"Survey Response",null,"YES","No action required."]
[null,null,null,"N/A"]
[null,null,null,"NO (Lennox Unit)","8.  MC to purchase and install SINGLE PAIR TWISTED {only Two (2) Wires) with FOIL SHIELD with DRAIN WIRE ComCable."]
[null,null,null,"NO (Trane Unit)","8.  MC to purchase and install One shielded Two conductor ComCable."]
[null,{"$f":"Survey!B33","v":"9.  Is a smoke detector present in unit?  If no smoked detector, enter NO.  If there is a smoke detector, enter YES."}]
[null,"Survey Response",null,"YES","See items 10, 11 and 12"]
[null,null,null,"N/A"]
[null,null,null,"NO","9.  MC to purchase and install new smoke detector that is OEM approved and is compatible with the deficient RTU model/serial #."]
[null,{"$f":"Survey!B35","v":"10.  Is the smoke detector inlet sampling tube capped?  If not capped, enter NO.  If capped enter YES."}]
[null,"Survey Response",null,"YES","No action required."]
[null,null,null,"N/A"]
[null,null,null,"NO","10.  MC to cap smoke detector inlet sampling tubes with appropriate part."]
[null,{"$f":"Survey!B37","v":"11.  Check smoke detector module light. If light RED or an AMBER color.  If either color, enter YES, and If not enter NO."}]
[null,"Survey Response",null,"YES","11.  TAB vendor to notify restaurant leadership and facilities management if RED or AMBER color light exists on the smoke detector module light."]
[null,null,null,"N/A"]
[null,null,null,"NO","No action required."]
[null,{"$f":"Survey!B39","v":"12.  Is smoke detector dust plugs capped?  If capped, enter YES, and if not enter NO."}]
[null,"Survey Response",null,"YES","12.  MC to remove dust plugs from unit."]
[null,null,null,"N/A"]
[null,null,null,"NO","No action required."]
[null,{"$f":"Survey!B41","v":"13.  Identify any damage to the blower.  If DAMAGE found, enter YES and if not enter NO.  Describe issue in Miscellaneous notes."}]
[null,"Survey Response",null,"YES (life expect. >85%","13.  Replace unit."]
[null,null,null,"YES (life expect. <=85%)","13.  MC to make needed repairs or replace blower wheel assembly if unrepairable."]
[null,null,null,"N/A"]
[null,null,null,"NO","No action required."]
[null,{"$f":"Survey!B43","v":"14.  Is blank plate secured or missing on B-cabinets?  If secured, enter YES and if not enter NO. If blank plate is missing, enter M."}]
[null,"Survey Response",null,"YES","No action required."]
[null,null,null,"N/A"]
[null,null,null,"NO","14.  MC to secure blank plate to unit cabinet."]
[null,null,null,"M","14.  MC to purchase and install blank plate in unit."]
[null,{"$f":"Survey!B45","v":"15.  Is ductwork lined?  If ductwork is lined, is it intact and undamaged?  If so, enter I.  If ductwork damaged and/or deteriorating, enter D.  If ductwork is not lined, enter NO."}]
[null,"Survey Response",null,"I/NO","No action required."]
[null,null,null,"N/A"]
[null,null,null,"D","15.  FC to add to SR scope of work removal and replacement of ductwork."]
[null,{"$f":"Survey!B47","v":"16. Are turning vanes present in the supply ducts of the units?  If turning vanes present enter YES and if not enter NO."}]
[null,"Survey Response",null,"YES","16.  See item 17."]
[null,null,null,"NO","16.  See item 19."]
[null,null,null,"N/A"]
[null,{"$f":"Survey!B49","v":"17. Are turning vanes single or double thickness?  If turning vanes double, enter D and if single enter S."}]
[null,"Survey Response",null,"D","17. No FM Mechanical Contractor SOW required.  If ceiling to be removed during SR project, SR will execute the SOW during the construction project."]
[null,null,null,"N/A"]
[null,null,null,"S","No action required."]
[null,{"$f":"Survey!B51","v":"18. Is canvas connector missing or damaged?  If no connector present, enter NO and if present enter YES.  If connector damaged enter D."}]
[null,"Survey Response",null,"YES","No action required."]
[null,null,null,"N/A"]
[null,null,null,"NO or D","18.  MC to select, purchase and install canvas connector appropriate for unit manufacturer serial number to fit ductwork properly."]
[null,{"$f":"Survey!B53","v":"19.  If turning vanes not present, is drop radiused?  If so, does radius equal the width of the duct? If radius does not equal duct width, enter NO and if does enter YES."}]
[null,"Survey Response",null,"YES","No action required."]
[null,null,null,"N/A"]
[null,null,null,"NO","17. No FM Mechanical Contractor SOW required.  If ceiling to be removed during SR project, SR will execute the SOW during the construction project."]
[null,{"$f":"Survey!B55","v":"20.  Check economizer setting at Master Control Boad.  If economizer set to zero, TAB to set the economizer position to the TAB sticker setpoint or damper shaft marking (If it exists) or to 20% open should no sticker or shaft marking exists.  If economizer doesn't stroke to desired position, enter \"D\" for deficiency.  If no deficiency enter ND."}]
[null,"Survey Response",null,"D","20.  FC's mechanical contractor/general contractor to make necessary repairs or replace economizer."]
[null,null,null,"N/A"]
[null,null,null,"ND","No action required."]
[null,{"$f":"Survey!B57","v":"21.  Provide condensation pipe size.  Minimum 1\" at playland unit, and 1.25\" at all other units.  NOTE: DROP DOWN MENUS FOR PIPE SIZE."}]
[null,"Survey Response",null,">1.25\"","No action required."]
[null,null,null,"<1.25\"","21.  MC to remove undersized condensate piping, and place  back properly sized piping."]
[null,{"$f":"Survey!B59","v":"22.  Incorrect MFR of devices or equipment installed that does not match CFA specifications.  If incorrect manufacturer devices found, enter YES and decribe deficiency in miscellaneous notes.  If not enter NO."}]
[null,"Survey Response",null,"YES","22.  See miscelleneous notes for deficiency."]
[null,null,null,"N/A"]
[null,null,null,"NO","No action required."]
[null,{"$f":"Survey!B72","v":"8.  Are thermostats Robert Shaw (Gray Display) or Network (Blue Display)? Enter \"RS\", \"NW\" for Robert Shaw and Network respectively.  If thermostat not Robert Shaw or Network enter NO."}]
[null,"Survey Response",null,"NW/RS","No action required."]
[null,null,null,"N/A"]
[null,null,null,"NO","8.  If there are some thermostats that meet CFA spec'd thermostats MC to match.  If all thermstats don't meet CFA spec, MC to purchase Northwest or Rober Shaw."]
[null,"EXHAUST FAN AND THERMOSTAT SCOPES"]
[null,"Suvey Response",null,"YES","1.  See miscellaneous note EF# for deficiency."]
[null,null,null,"NO","1.  No action required."]
[null,"Survey Response",null,"YES","2.  Replace missing access door and/or repair any damaged seals or gaskets."]
[null,null,null,"NO","2.  No action required."]
[null,null,null,"MG","2.  MC to provide and install missing gasket."]
[null,"Survey Response",null,"YES","3.  See miscellaneous note EF#a for deficiency."]
[null,null,null,"NO","3.  No action required."]
[null,"Survey Response",null,"YES","No action required."]
[null,null,null,"NO","? ? ? ? ? ? ? ? ? ?"]
[]
[]
[null,"CLIMATE ZONES"]
[null,"ZONE #",null,"LIFE EXPECTANCY"]
[null,1,null,12]
[null,2,null,12]
[null,3,null,12]
[null,4,null,12]
[null,5,null,12]
[null,6,null,12]
[null,7,null,12]

{"sheet":"SYNEXIS","index":15,"n_rows":418,"n_cols":2,"rows_kept":418,"cut":false,"hidden":true,"merged":[]}
[null,"Customer Status"]
[4941,"Active"]
[539,"Active"]
[2777,"Active"]
[3184,"Active"]
[2928,"Active"]
[2209,"Active"]
[4251,"Active"]
[3303,"Active"]
[3540,"Active"]
[1724,"Active"]
[2629,"Active"]
[1293,"Active"]
[1047,"Active"]
[1826,"Active"]
[9,"Active"]
[4574,"Active"]
[1414,"Active"]
[418,"Active"]
[2117,"Active"]
[4628,"Active"]
[1709,"Active"]
[2813,"Active"]
[4013,"Active"]
[2292,"Active"]
[2449,"Active"]
[2984,"Active"]
[1703,"Active"]
[718,"Active"]
[3642,"Active"]
[3381,"Active"]
[4006,"Active"]
[3497,"Active"]
[4175,"Active"]
[2858,"Active"]
[2821,"Active"]
[4102,"Active"]
[457,"Active"]
[3192,"Active"]
[1149,"Active"]
[2829,"Active"]
[1368,"Active"]
[4279,"Active"]
[3507,"Active"]
[799,"Active"]
[4325,"Active"]
[1227,"Active"]
[1976,"Active"]
[3740,"Active"]
[3778,"Active"]
[3829,"Active"]
[1763,"Active"]
[1585,"Active"]
[2913,"Active"]
[3312,"Active"]
[1130,"Active"]
[1544,"Active"]
[2869,"Active"]
[4133,"Active"]
[1086,"Active"]
[1706,"Active"]
[1601,"Active"]
[3154,"Active"]
[2981,"Active"]
[1222,"Active"]
[4324,"Active"]
[2784,"Active"]
[1951,"Active"]
[2363,"Active"]
[3180,"Active"]
[3749,"Active"]
[3146,"Active"]
[2665,"Active"]
[4081,"Active"]
[1454,"Active"]
[1449,"Active"]
[3755,"Active"]
[3693,"Active"]
[592,"Active"]
[1956,"Active"]
[1048,"Active"]
[92,"Active"]
[3675,"Active"]
[1639,"Active"]
[2571,"Active"]
[4566,"Active"]
[717,"Active"]
[792,"Active"]
[4093,"Active"]
[1085,"Active"]
[4791,"Active"]
[1980,"Active"]
[3449,"Active"]
[1814,"Active"]
[1867,"Active"]
[4028,"Active"]
[3255,"Active"]
[981,"Active"]
[2500,"Active"]
[4345,"Active"]
[4335,"Active"]
[1691,"Active"]
[1183,"Active"]
[1591,"Active"]
[4159,"Active"]
[791,"Active"]
[1883,"Active"]
[4451,"Active"]
[859,"Active"]
[1228,"Active"]
[2415,"Active"]
[528,"Active"]
[2034,"Active"]
[2918,"Active"]
[2797,"Active"]
[756,"Active"]
[4695,"Active"]
[3031,"Active"]
[3511,"Active"]
[745,"Active"]
[1999,"Active"]
[4215,"Active"]
[2193,"Active"]
[2425,"Active"]
[2763,"Active"]
[4103,"Active"]
[562,"Active"]
[1259,"Active"]
[869,"Active"]
[3309,"Active"]
[2616,"Active"]
[2436,"Active"]
[1546,"Active"]
[2825,"Active"]
[3904,"Active"]
[3664,"Active"]
[2545,"Active"]
[2942,"Active"]
[4344,"Active"]
[3334,"Active"]
[2086,"Active"]
[3571,"Active"]
[3273,"Active"]
[2664,"Active"]
[1089,"Active"]
[2884,"Active"]
[2906,"Active"]
[1210,"Active"]
[1493,"Active"]
[3592,"Active"]
[2047,"Active"]
[1463,"Active"]
[2957,"Active"]
[1769,"Active"]
[2493,"Active"]
[3072,"Active"]
[2435,"Active"]
[694,"Active"]
[3060,"Active"]
[2264,"Active"]
[3288,"Active"]
[2201,"Active"]
[2551,"Active"]
[3713,"Active"]
[771,"Active"]
[2103,"Active"]
[4717,"Active"]
[1682,"Active"]
[3468,"Active"]
[1111,"Active"]
[242,"Active"]
[2585,"Active"]
[4072,"Active"]
[2681,"Active"]
[3529,"Active"]
[3898,"Active"]
[1977,"Active"]
[1501,"Active"]
[2483,"Active"]
[1018,"Active"]
[1986,"Active"]
[3848,"Active"]
[3422,"Active"]
[2644,"Active"]
[1825,"Active"]
[2244,"Active"]
[3825,"Active"]
[3308,"Active"]
[3972,"Active"]
[3018,"Active"]
[1390,"Active"]
[1731,"Active"]
[701,"Active"]
[1072,"Active"]
[2621,"Active"]
[3619,"Active"]
[3925,"Active"]
[2849,"Active"]
[3138,"Active"]
[3032,"Active"]
[2956,"Active"]
[1125,"Active"]
[2587,"Active"]
[2931,"Active"]
[3141,"Active"]
[4000,"Active"]
[4769,"Active"]
[3366,"Active"]
[4023,"Active"]
[1649,"Active"]
[1635,"Active"]
[1284,"Active"]
[3957,"Active"]
[4473,"Active"]
[2822,"Active"]
[695,"Active"]
[3632,"Active"]
[3490,"Active"]
[4063,"Active"]
[1579,"Active"]
[1805,"Active"]
[1796,"Active"]
[3810,"Active"]
[4310,"Active"]
[1098,"Active"]
[1524,"Active"]
[3212,"Active"]
[643,"Active"]
[777,"Active"]
[2759,"Active"]
[2470,"Active"]
[1995,"Active"]
[288,"Active"]
[3077,"Active"]
[3562,"Active"]
[3489,"Active"]
[1509,"Active"]
[3795,"Active"]
[1280,"Active"]
[986,"Active"]
[1445,"Active"]
[358,"Active"]
[3106,"Active"]
[1942,"Active"]
[1661,"Active"]
[4621,"Active"]
[3526,"Active"]
[4073,"Active"]
[3262,"Active"]
[3343,"Active"]
[4235,"Active"]
[524,"Active"]
[3423,"Active"]
[1855,"Active"]
[3037,"Active"]
[1083,"Active"]
[737,"Active"]
[1772,"Active"]
[3300,"Active"]
[3790,"Active"]
[3533,"Active"]
[4139,"Active"]
[3794,"Active"]
[2289,"Active"]
[3248,"Active"]
[4323,"Active"]
[4329,"Active"]
[2698,"Active"]
[8,"Active"]
[930,"Active"]
[2508,"Active"]
[3901,"Active"]
[3750,"Active"]
[579,"Active"]
[4480,"Active"]
[2955,"Active"]
[2024,"Active"]
[2599,"Active"]
[1170,"Active"]
[2792,"Active"]
[1431,"Active"]
[1069,"Active"]
[2820,"Inactive - Cancelled"]
[2331,"Inactive - Cancelled"]
[3667,"Inactive - Cancelled"]
[4085,"Inactive - Cancelled"]
[3823,"Inactive - Cancelled"]
[3694,"Inactive - Cancelled"]
[3295,"Inactive - Cancelled"]
[3382,"Inactive - Cancelled"]
[3809,"Inactive - Cancelled"]
[2713,"Inactive - Cancelled"]
[482,"Inactive - Cancelled"]
[2456,"Inactive - Cancelled"]
[3374,"Inactive - Cancelled"]
[368,"Inactive - Cancelled"]
[829,"Inactive - Cancelled"]
[1704,"Inactive - Cancelled"]
[2817,"Inactive - Cancelled"]
[3791,"Inactive - Cancelled"]
[1433,"Inactive - Cancelled"]
[3840,"Inactive - Cancelled"]
[231,"Inactive - Cancelled"]
[3433,"Inactive - Cancelled"]
[4496,"Inactive - Cancelled"]
[430,"Inactive - Cancelled"]
[4627,"Inactive - Cancelled"]
[1385,"Inactive - Cancelled"]
[3827,"Inactive - Cancelled"]
[2407,"Inactive - Cancelled"]
[1446,"Inactive - Cancelled"]
[2066,"Inactive - Cancelled"]
[4437,"Inactive - Cancelled"]
[3432,"Inactive - Cancelled"]
[2947,"Inactive - Cancelled"]
[3189,"Inactive - Cancelled"]
[3486,"Inactive - Cancelled"]
[3769,"Inactive - Cancelled"]
[4068,"Inactive - Cancelled"]
[2050,"Inactive - Cancelled"]
[4271,"Inactive - Cancelled"]
[1764,"Inactive - Cancelled"]
[4144,"Inactive - Cancelled"]
[3748,"Inactive - Cancelled"]
[3544,"Inactive - Cancelled"]
[4457,"Inactive - Cancelled"]
[1732,"Inactive - Cancelled"]
[4264,"Inactive - Cancelled"]
[2968,"Inactive - Cancelled"]
[3239,"Inactive - Cancelled"]
[2185,"Inactive - Cancelled"]
[1031,"Inactive - Cancelled"]
[3040,"Inactive - Cancelled"]
[1540,"Inactive - Cancelled"]
[3912,"Inactive - Cancelled"]
[1647,"Inactive - Cancelled"]
[2640,"Inactive - Cancelled"]
[3431,"Inactive - Cancelled"]
[3817,"Inactive - Cancelled"]
[2788,"Inactive - Cancelled"]
[2793,"Inactive - Cancelled"]
[1827,"Inactive - Cancelled"]
[2509,"Inactive - Cancelled"]
[2367,"Inactive - Cancelled"]
[3695,"Inactive - Cancelled"]
[3440,"Inactive - Cancelled"]
[2194,"Inactive - Cancelled"]
[1103,"Inactive - Cancelled"]
[1186,"Inactive - Cancelled"]
[1815,"Inactive - Cancelled"]
[4827,"Inactive - Cancelled"]
[2501,"Inactive - Cancelled"]
[1053,"Inactive - Cancelled"]
[3307,"Inactive - Cancelled"]
[3843,"Inactive - Cancelled"]
[3424,"Inactive - Cancelled"]
[1886,"Inactive - Cancelled"]
[2131,"Inactive - Cancelled"]
[4070,"Inactive - Cancelled"]
[3688,"Inactive - Cancelled"]
[662,"Inactive - Cancelled"]
[2013,"Inactive - Cancelled"]
[4402,"Inactive - Cancelled"]
[3195,"Inactive - Cancelled"]
[3372,"Inactive - Cancelled"]
[3022,"Inactive - Cancelled"]
[1014,"Inactive - Cancelled"]
[3499,"Inactive - Cancelled"]
[2891,"Inactive - Cancelled"]
[3253,"Inactive - Cancelled"]
[1982,"Inactive - Cancelled"]
[2899,"Inactive - Cancelled"]
[998,"Inactive - Cancelled"]
[3808,"Inactive - Cancelled"]
[3613,"Inactive - Cancelled"]
[3020,"Inactive - Cancelled"]
[361,"Inactive - Cancelled"]
[4800,"Inactive - Cancelled"]
[3410,"Inactive - Cancelled"]
[57,"Inactive - Cancelled"]
[3622,"Inactive - Cancelled"]
[3578,"Inactive - Cancelled"]
[2662,"Inactive - Cancelled"]
[2320,"Inactive - Cancelled"]
[1939,"Inactive - Cancelled"]
[1895,"Inactive - Cancelled"]
[3773,"Inactive - Cancelled"]
[3685,"Inactive - Cancelled"]
[4149,"Inactive - Cancelled"]
[2000,"Inactive - Cancelled"]
[3763,"Inactive - Non-Renewed"]
[3662,"Inactive - Non-Renewed"]
[2636,"Inactive - Non-Renewed"]
[2141,"Inactive - Non-Renewed"]
[1739,"Inactive - Non-Renewed"]
[1139,"Inactive - Non-Renewed"]
[3830,"Inactive - Non-Renewed"]
[3700,"Inactive - Non-Renewed"]
[1911,"Inactive - Non-Renewed"]
[1223,"Inactive - Non-Renewed"]
[732,"Inactive - Non-Renewed"]
[2811,"Inactive - Non-Renewed"]
[1481,"Inactive - Non-Renewed"]
[1947,"Inactive - Non-Renewed"]
[2856,"Inactive - Non-Renewed"]
[2940,"Inactive - Non-Renewed"]
[1157,"Inactive - Non-Renewed"]
[1248,"Inactive - Non-Renewed"]
[617,"Inactive - Non-Renewed"]
[3056,"Inactive - Non-Renewed"]
[2680,"Inactive - Non-Renewed"]
[2554,"Inactive - Non-Renewed"]
[4386,"Inactive - Non-Renewed"]
[2688,"Inactive - Non-Renewed"]
[2724,"Inactive - Non-Renewed"]
[1489,"Inactive - Non-Renewed"]
[1697,"Inactive - Non-Renewed"]
[4040,"Inactive - Non-Renewed"]

{"sheet":"IECC ","index":16,"n_rows":3237,"n_cols":9,"rows_kept":3237,"cut":false,"hidden":true,"merged":[[0,1,0,8]]}
[null,"IECC AND BUILDIDNG AMERICA CLIMATE ZONES BY UNITED STATES COUNTY (gist.gethub.com)"]
[null,"HELPER","County Name","State","State FIPS","County FIPS","IECC Climate Zone","IECC Moisture Regime","BA Climate Zone"]
[null,{"$f":"CONCATENATE(C3,D3)","v":"Aleutians EastAK"},"Aleutians East","AK",2,13,7,"N/A","Very Cold"]
[null,{"$f":"CONCATENATE(C4,D4)","v":"Aleutians WestAK"},"Aleutians West","AK",2,16,7,"N/A","Very Cold"]
[null,"AnchorageAK","Anchorage","AK",2,20,7,"N/A","Very Cold"]
[null,"BethelAK","Bethel","AK",2,50,8,"N/A","Subarctic"]
[null,"Bristol BayAK","Bristol Bay","AK",2,60,7,"N/A","Very Cold"]
[null,"DenaliAK","Denali","AK",2,68,7,"N/A","Very Cold"]
[null,"DillinghamAK","Dillingham","AK",2,70,8,"N/A","Subarctic"]
[null,"Fairbanks North StarAK","Fairbanks North Star","AK",2,90,8,"N/A","Subarctic"]
[null,"HainesAK","Haines","AK",2,100,7,"N/A","Very Cold"]
[null,"Hoonah-AngoonAK","Hoonah-Angoon","AK",2,105,7,"N/A","Very Cold"]
[null,"JuneauAK","Juneau","AK",2,110,7,"N/A","Very Cold"]
[null,"Kenai PeninsulaAK","Kenai Peninsula","AK",2,122,7,"N/A","Very Cold"]
[null,"Ketchikan GatewayAK","Ketchikan Gateway","AK",2,130,7,"N/A","Very Cold"]
[null,"Kodiak IslandAK","Kodiak Island","AK",2,150,7,"N/A","Very Cold"]
[null,"KusilvakAK","Kusilvak","AK",2,158,8,"N/A","Subarctic"]
[null,"Lake and PeninsulaAK","Lake and Peninsula","AK",2,164,7,"N/A","Very Cold"]
[null,"Matanuska-SusitnaAK","Matanuska-Susitna","AK",2,170,7,"N/A","Very Cold"]
[null,"NomeAK","Nome","AK",2,180,8,"N/A","Subarctic"]
[null,"North SlopeAK","North Slope","AK",2,185,8,"N/A","Subarctic"]
[null,"Northwest ArcticAK","Northwest Arctic","AK",2,188,8,"N/A","Subarctic"]
[null,"PetersburgAK","Petersburg","AK",2,195,7,"N/A","Very Cold"]
[null,"Prince of Wales-HyderAK","Prince of Wales-Hyder","AK",2,198,7,"N/A","Very Cold"]
[null,"SitkaAK","Sitka","AK",2,220,7,"N/A","Very Cold"]
[null,"SkagwayAK","Skagway","AK",2,230,7,"N/A","Very Cold"]
[null,"Southeast FairbanksAK","Southeast Fairbanks","AK",2,240,8,"N/A","Subarctic"]
[null,"Valdez-CordovaAK","Valdez-Cordova","AK",2,261,7,"N/A","Very Cold"]
[null,"WrangellAK","Wrangell","AK",2,275,7,"N/A","Very Cold"]
[null,"YakutatAK","Yakutat","AK",2,282,7,"N/A","Very Cold"]
[null,"Yukon-KoyukukAK","Yukon-Koyukuk","AK",2,290,8,"N/A","Subarctic"]
[null,"AutaugaAL","Autauga","AL",1,1,3,"A","Hot-Humid"]
[null,"BaldwinAL","Baldwin","AL",1,3,2,"A","Hot-Humid"]
[null,"BarbourAL","Barbour","AL",1,5,3,"A","Hot-Humid"]
[null,"BibbAL","Bibb","AL",1,7,3,"A","Mixed-Humid"]
[null,"BlountAL","Blount","AL",1,9,3,"A","Mixed-Humid"]
[null,"BullockAL","Bullock","AL",1,11,3,"A","Hot-Humid"]
[null,"ButlerAL","Butler","AL",1,13,3,"A","Hot-Humid"]
[null,"CalhounAL","Calhoun","AL",1,15,3,"A","Mixed-Humid"]
[null,"ChambersAL","Chambers","AL",1,17,3,"A","Mixed-Humid"]
[null,"CherokeeAL","Cherokee","AL",1,19,3,"A","Mixed-Humid"]
[null,"ChiltonAL","Chilton","AL",1,21,3,"A","Mixed-Humid"]
[null,"ChoctawAL","Choctaw","AL",1,23,3,"A","Hot-Humid"]
[null,"ClarkeAL","Clarke","AL",1,25,3,"A","Hot-Humid"]
[null,"ClayAL","Clay","AL",1,27,3,"A","Mixed-Humid"]
[null,"CleburneAL","Cleburne","AL",1,29,3,"A","Mixed-Humid"]
[null,"CoffeeAL","Coffee","AL",1,31,3,"A","Hot-Humid"]
[null,"ColbertAL","Colbert","AL",1,33,3,"A","Mixed-Humid"]
[null,"ConecuhAL","Conecuh","AL",1,35,3,"A","Hot-Humid"]
[null,"CoosaAL","Coosa","AL",1,37,3,"A","Mixed-Humid"]
[null,"CovingtonAL","Covington","AL",1,39,3,"A","Hot-Humid"]
[null,"CrenshawAL","Crenshaw","AL",1,41,3,"A","Hot-Humid"]
[null,"CullmanAL","Cullman","AL",1,43,3,"A","Mixed-Humid"]
[null,"DaleAL","Dale","AL",1,45,3,"A","Hot-Humid"]
[null,"DallasAL","Dallas","AL",1,47,3,"A","Hot-Humid"]
[null,"DeKalbAL","DeKalb","AL",1,49,3,"A","Mixed-Humid"]
[null,"ElmoreAL","Elmore","AL",1,51,3,"A","Hot-Humid"]
[null,"EscambiaAL","Escambia","AL",1,53,3,"A","Hot-Humid"]
[null,"EtowahAL","Etowah","AL",1,55,3,"A","Mixed-Humid"]
[null,"FayetteAL","Fayette","AL",1,57,3,"A","Mixed-Humid"]
[null,"FranklinAL","Franklin","AL",1,59,3,"A","Mixed-Humid"]
[null,"GenevaAL","Geneva","AL",1,61,3,"A","Hot-Humid"]
[null,"GreeneAL","Greene","AL",1,63,3,"A","Mixed-Humid"]
[null,"HaleAL","Hale","AL",1,65,3,"A","Mixed-Humid"]
[null,"HenryAL","Henry","AL",1,67,3,"A","Hot-Humid"]
[null,"HoustonAL","Houston","AL",1,69,3,"A","Hot-Humid"]
[null,"JacksonAL","Jackson","AL",1,71,3,"A","Mixed-Humid"]
[null,{"$f":"CONCATENATE(C68,D68)","v":"JeffersonAL"},"Jefferson","AL",1,73,3,"A","Mixed-Humid"]
[null,"LamarAL","Lamar","AL",1,75,3,"A","Mixed-Humid"]
[null,"LauderdaleAL","Lauderdale","AL",1,77,3,"A","Mixed-Humid"]
[null,"LawrenceAL","Lawrence","AL",1,79,3,"A","Mixed-Humid"]
[null,"LeeAL","Lee","AL",1,81,3,"A","Mixed-Humid"]
[null,"LimestoneAL","Limestone","AL",1,83,3,"A","Mixed-Humid"]
[null,"LowndesAL","Lowndes","AL",1,85,3,"A","Hot-Humid"]
[null,"MaconAL","Macon","AL",1,87,3,"A","Hot-Humid"]
[null,"MadisonAL","Madison","AL",1,89,3,"A","Mixed-Humid"]
[null,"MarengoAL","Marengo","AL",1,91,3,"A","Hot-Humid"]
[null,"MarionAL","Marion","AL",1,93,3,"A","Mixed-Humid"]
[null,"MarshallAL","Marshall","AL",1,95,3,"A","Mixed-Humid"]
[null,"MobileAL","Mobile","AL",1,97,2,"A","Hot-Humid"]
[null,"MonroeAL","Monroe","AL",1,99,3,"A","Hot-Humid"]
[null,"MontgomeryAL","Montgomery","AL",1,101,3,"A","Hot-Humid"]
[null,"MorganAL","Morgan","AL",1,103,3,"A","Mixed-Humid"]
[null,"PerryAL","Perry","AL",1,105,3,"A","Hot-Humid"]
[null,"PickensAL","Pickens","AL",1,107,3,"A","Mixed-Humid"]
[null,"PikeAL","Pike","AL",1,109,3,"A","Hot-Humid"]
[null,"RandolphAL","Randolph","AL",1,111,3,"A","Mixed-Humid"]
[null,"RussellAL","Russell","AL",1,113,3,"A","Hot-Humid"]
[null,"ShelbyAL","Shelby","AL",1,117,3,"A","Mixed-Humid"]
[null,"St. ClairAL","St. Clair","AL",1,115,3,"A","Mixed-Humid"]
[null,"SumterAL","Sumter","AL",1,119,3,"A","Mixed-Humid"]
[null,"TalladegaAL","Talladega","AL",1,121,3,"A","Mixed-Humid"]
[null,"TallapoosaAL","Tallapoosa","AL",1,123,3,"A","Mixed-Humid"]
[null,"TuscaloosaAL","Tuscaloosa","AL",1,125,3,"A","Mixed-Humid"]
[null,"WalkerAL","Walker","AL",1,127,3,"A","Mixed-Humid"]
[null,"WashingtonAL","Washington","AL",1,129,3,"A","Hot-Humid"]
[null,"WilcoxAL","Wilcox","AL",1,131,3,"A","Hot-Humid"]
[null,"WinstonAL","Winston","AL",1,133,3,"A","Mixed-Humid"]
[null,"ArkansasAR","Arkansas","AR",5,1,3,"A","Mixed-Humid"]
[null,"AshleyAR","Ashley","AR",5,3,3,"A","Mixed-Humid"]
[null,"BaxterAR","Baxter","AR",5,5,4,"A","Mixed-Humid"]
[null,"BentonAR","Benton","AR",5,7,4,"A","Mixed-Humid"]
[null,"BooneAR","Boone","AR",5,9,4,"A","Mixed-Humid"]
[null,"BradleyAR","Bradley","AR",5,11,3,"A","Mixed-Humid"]
[null,"CalhounAR","Calhoun","AR",5,13,3,"A","Mixed-Humid"]
[null,"CarrollAR","Carroll","AR",5,15,4,"A","Mixed-Humid"]
[null,"ChicotAR","Chicot","AR",5,17,3,"A","Mixed-Humid"]
[null,"ClarkAR","Clark","AR",5,19,3,"A","Mixed-Humid"]
[null,"ClayAR","Clay","AR",5,21,3,"A","Mixed-Humid"]
[null,"CleburneAR","Cleburne","AR",5,23,3,"A","Mixed-Humid"]
[null,"ClevelandAR","Cleveland","AR",5,25,3,"A","Mixed-Humid"]
[null,"ColumbiaAR","Columbia","AR",5,27,3,"A","Hot-Humid"]
[null,"ConwayAR","Conway","AR",5,29,3,"A","Mixed-Humid"]
[null,"CraigheadAR","Craighead","AR",5,31,3,"A","Mixed-Humid"]
[null,"CrawfordAR","Crawford","AR",5,33,3,"A","Mixed-Humid"]
[null,"CrittendenAR","Crittenden","AR",5,35,3,"A","Mixed-Humid"]
[null,"CrossAR","Cross","AR",5,37,3,"A","Mixed-Humid"]
[null,"DallasAR","Dallas","AR",5,39,3,"A","Mixed-Humid"]
[null,"DeshaAR","Desha","AR",5,41,3,"A","Mixed-Humid"]
[null,"DrewAR","Drew","AR",5,43,3,"A","Mixed-Humid"]
[null,"FaulknerAR","Faulkner","AR",5,45,3,"A","Mixed-Humid"]
[null,"FranklinAR","Franklin","AR",5,47,3,"A","Mixed-Humid"]
[null,"FultonAR","Fulton","AR",5,49,4,"A","Mixed-Humid"]
[null,"GarlandAR","Garland","AR",5,51,3,"A","Mixed-Humid"]
[null,"GrantAR","Grant","AR",5,53,3,"A","Mixed-Humid"]
[null,"GreeneAR","Greene","AR",5,55,3,"A","Mixed-Humid"]
[null,"HempsteadAR","Hempstead","AR",5,57,3,"A","Mixed-Humid"]
[null,"Hot SpringAR","Hot Spring","AR",5,59,3,"A","Mixed-Humid"]
[null,"HowardAR","Howard","AR",5,61,3,"A","Mixed-Humid"]
[null,"IndependenceAR","Independence","AR",5,63,3,"A","Mixed-Humid"]
[null,"IzardAR","Izard","AR",5,65,4,"A","Mixed-Humid"]
[null,{"$f":"CONCATENATE(C132,D132)","v":"JacksonAR"},"Jackson","AR",5,67,3,"A","Mixed-Humid"]
[null,"JeffersonAR","Jefferson","AR",5,69,3,"A","Mixed-Humid"]
[null,"JohnsonAR","Johnson","AR",5,71,3,"A","Mixed-Humid"]
[null,"LafayetteAR","Lafayette","AR",5,73,3,"A","Hot-Humid"]
[null,"LawrenceAR","Lawrence","AR",5,75,3,"A","Mixed-Humid"]
[null,"LeeAR","Lee","AR",5,77,3,"A","Mixed-Humid"]
[null,"LincolnAR","Lincoln","AR",5,79,3,"A","Mixed-Humid"]
[null,"Little RiverAR","Little River","AR",5,81,3,"A","Hot-Humid"]
[null,"LoganAR","Logan","AR",5,83,3,"A","Mixed-Humid"]
[null,"LonokeAR","Lonoke","AR",5,85,3,"A","Mixed-Humid"]
[null,"MadisonAR","Madison","AR",5,87,4,"A","Mixed-Humid"]
[null,"MarionAR","Marion","AR",5,89,4,"A","Mixed-Humid"]
[null,"MillerAR","Miller","AR",5,91,3,"A","Hot-Humid"]
[null,"MississippiAR","Mississippi","AR",5,93,3,"A","Mixed-Humid"]
[null,"MonroeAR","Monroe","AR",5,95,3,"A","Mixed-Humid"]
[null,"MontgomeryAR","Montgomery","AR",5,97,3,"A","Mixed-Humid"]
[null,"NevadaAR","Nevada","AR",5,99,3,"A","Mixed-Humid"]
[null,"NewtonAR","Newton","AR",5,101,4,"A","Mixed-Humid"]
[null,"OuachitaAR","Ouachita","AR",5,103,3,"A","Mixed-Humid"]
[null,"PerryAR","Perry","AR",5,105,3,"A","Mixed-Humid"]
[null,"PhillipsAR","Phillips","AR",5,107,3,"A","Mixed-Humid"]
[null,"PikeAR","Pike","AR",5,109,3,"A","Mixed-Humid"]
[null,"PoinsettAR","Poinsett","AR",5,111,3,"A","Mixed-Humid"]
[null,"PolkAR","Polk","AR",5,113,3,"A","Mixed-Humid"]
[null,"PopeAR","Pope","AR",5,115,3,"A","Mixed-Humid"]
[null,"PrairieAR","Prairie","AR",5,117,3,"A","Mixed-Humid"]
[null,"PulaskiAR","Pulaski","AR",5,119,3,"A","Mixed-Humid"]
[null,"RandolphAR","Randolph","AR",5,121,3,"A","Mixed-Humid"]
[null,"SalineAR","Saline","AR",5,125,3,"A","Mixed-Humid"]
[null,"ScottAR","Scott","AR",5,127,3,"A","Mixed-Humid"]
[null,"SearcyAR","Searcy","AR",5,129,4,"A","Mixed-Humid"]
[null,"SebastianAR","Sebastian","AR",5,131,3,"A","Mixed-Humid"]
[null,"SevierAR","Sevier","AR",5,133,3,"A","Mixed-Humid"]
[null,"SharpAR","Sharp","AR",5,135,3,"A","Mixed-Humid"]
[null,"St. FrancisAR","St. Francis","AR",5,123,3,"A","Mixed-Humid"]
[null,"StoneAR","Stone","AR",5,137,4,"A","Mixed-Humid"]
[null,"UnionAR","Union","AR",5,139,3,"A","Hot-Humid"]
[null,"Van BurenAR","Van Buren","AR",5,141,3,"A","Mixed-Humid"]
[null,"WashingtonAR","Washington","AR",5,143,4,"A","Mixed-Humid"]
[null,"WhiteAR","White","AR",5,145,3,"A","Mixed-Humid"]
[null,"WoodruffAR","Woodruff","AR",5,147,3,"A","Mixed-Humid"]
[null,"YellAR","Yell","AR",5,149,3,"A","Mixed-Humid"]
[null,"Eastern DistrictAS","Eastern District","AS",60,10,1,"A","Hot-Humid"]
[null,"Manu'a DistrictAS","Manu'a District","AS",60,20,1,"A","Hot-Humid"]
[null,"Rose IslandAS","Rose Island","AS",60,30,1,"A","Hot-Humid"]
[null,"Swains IslandAS","Swains Island","AS",60,40,1,"A","Hot-Humid"]
[null,"Western DistrictAS","Western District","AS",60,50,1,"A","Hot-Humid"]
[null,"ApacheAZ","Apache","AZ",4,1,5,"B","Cold"]
[null,"CochiseAZ","Cochise","AZ",4,3,3,"B","Hot-Dry"]
[null,"CoconinoAZ","Coconino","AZ",4,5,5,"B","Cold"]
[null,"GilaAZ","Gila","AZ",4,7,4,"B","Mixed-Dry"]
[null,"GrahamAZ","Graham","AZ",4,9,3,"B","Hot-Dry"]
[null,"GreenleeAZ","Greenlee","AZ",4,11,3,"B","Hot-Dry"]
[null,"La PazAZ","La Paz","AZ",4,12,2,"B","Hot-Dry"]
[null,"MaricopaAZ","Maricopa","AZ",4,13,2,"B","Hot-Dry"]
[null,"MohaveAZ","Mohave","AZ",4,15,3,"B","Hot-Dry"]
[null,"NavajoAZ","Navajo","AZ",4,17,5,"B","Cold"]
[null,"PimaAZ","Pima","AZ",4,19,2,"B","Hot-Dry"]
[null,"PinalAZ","Pinal","AZ",4,21,2,"B","Hot-Dry"]
[null,"Santa CruzAZ","Santa Cruz","AZ",4,23,3,"B","Hot-Dry"]
[null,"YavapaiAZ","Yavapai","AZ",4,25,4,"B","Mixed-Dry"]
[null,"YumaAZ","Yuma","AZ",4,27,2,"B","Hot-Dry"]
[null,"AlamedaCA","Alameda","CA",6,1,3,"C","Marine"]
[null,"AlpineCA","Alpine","CA",6,3,6,"B","Cold"]
[null,{"$f":"CONCATENATE(C196,D196)","v":"AmadorCA"},"Amador","CA",6,5,4,"B","Mixed-Dry"]
[null,"ButteCA","Butte","CA",6,7,3,"B","Hot-Dry"]
[null,"CalaverasCA","Calaveras","CA",6,9,4,"B","Mixed-Dry"]
[null,"ColusaCA","Colusa","CA",6,11,3,"B","Hot-Dry"]
[null,"Contra CostaCA","Contra Costa","CA",6,13,3,"B","Hot-Dry"]
[null,"Del NorteCA","Del Norte","CA",6,15,4,"C","Marine"]
[null,"El DoradoCA","El Dorado","CA",6,17,4,"B","Mixed-Dry"]
[null,"FresnoCA","Fresno","CA",6,19,3,"B","Hot-Dry"]
[null,"GlennCA","Glenn","CA",6,21,3,"B","Hot-Dry"]
[null,"HumboldtCA","Humboldt","CA",6,23,4,"C","Marine"]
[null,"ImperialCA","Imperial","CA",6,25,2,"B","Hot-Dry"]
[null,"InyoCA","Inyo","CA",6,27,4,"B","Mixed-Dry"]
[null,"KernCA","Kern","CA",6,29,3,"B","Hot-Dry"]
[null,"KingsCA","Kings","CA",6,31,3,"B","Hot-Dry"]
[null,"LakeCA","Lake","CA",6,33,4,"B","Mixed-Dry"]
[null,"LassenCA","Lassen","CA",6,35,5,"B","Cold"]
[null,"Los AngelesCA","Los Angeles","CA",6,37,3,"B","Hot-Dry"]
[null,"MaderaCA","Madera","CA",6,39,3,"B","Hot-Dry"]
[null,"MarinCA","Marin","CA",6,41,3,"C","Marine"]
[null,"MariposaCA","Mariposa","CA",6,43,4,"B","Mixed-Dry"]
[null,"MendocinoCA","Mendocino","CA",6,45,3,"C","Marine"]
[null,"MercedCA","Merced","CA",6,47,3,"B","Hot-Dry"]
[null,"ModocCA","Modoc","CA",6,49,5,"B","Cold"]
[null,"MonoCA","Mono","CA",6,51,6,"B","Cold"]
[null,"MontereyCA","Monterey","CA",6,53,3,"C","Marine"]
[null,"NapaCA","Napa","CA",6,55,3,"C","Marine"]
[null,"NevadaCA","Nevada","CA",6,57,5,"B","Cold"]
[null,"OrangeCA","Orange","CA",6,59,3,"B","Hot-Dry"]
[null,"PlacerCA","Placer","CA",6,61,3,"B","Hot-Dry"]
[null,"PlumasCA","Plumas","CA",6,63,5,"B","Cold"]
[null,"RiversideCA","Riverside","CA",6,65,3,"B","Hot-Dry"]
[null,"SacramentoCA","Sacramento","CA",6,67,3,"B","Hot-Dry"]
[null,"San BenitoCA","San Benito","CA",6,69,3,"C","Marine"]
[null,"San BernardinoCA","San Bernardino","CA",6,71,3,"B","Hot-Dry"]
[null,"San DiegoCA","San Diego","CA",6,73,3,"B","Hot-Dry"]
[null,"San FranciscoCA","San Francisco","CA",6,75,3,"C","Marine"]
[null,"San JoaquinCA","San Joaquin","CA",6,77,3,"B","Hot-Dry"]
[null,"San Luis ObispoCA","San Luis Obispo","CA",6,79,3,"C","Marine"]
[null,"San MateoCA","San Mateo","CA",6,81,3,"C","Marine"]
[null,"Santa BarbaraCA","Santa Barbara","CA",6,83,3,"C","Marine"]
[null,"Santa ClaraCA","Santa Clara","CA",6,85,3,"C","Marine"]
[null,"Santa CruzCA","Santa Cruz","CA",6,87,3,"C","Marine"]
[null,"ShastaCA","Shasta","CA",6,89,3,"B","Hot-Dry"]
[null,"SierraCA","Sierra","CA",6,91,5,"B","Cold"]
[null,"SiskiyouCA","Siskiyou","CA",6,93,5,"B","Cold"]
[null,"SolanoCA","Solano","CA",6,95,3,"B","Hot-Dry"]
[null,"SonomaCA","Sonoma","CA",6,97,3,"C","Marine"]
[null,"StanislausCA","Stanislaus","CA",6,99,3,"B","Hot-Dry"]
[null,"SutterCA","Sutter","CA",6,101,3,"B","Hot-Dry"]
[null,"TehamaCA","Tehama","CA",6,103,3,"B","Hot-Dry"]
[null,"TrinityCA","Trinity","CA",6,105,4,"B","Mixed-Dry"]
[null,"TulareCA","Tulare","CA",6,107,3,"B","Hot-Dry"]
[null,"TuolumneCA","Tuolumne","CA",6,109,4,"B","Mixed-Dry"]
[null,"VenturaCA","Ventura","CA",6,111,3,"C","Marine"]
[null,"YoloCA","Yolo","CA",6,113,3,"B","Hot-Dry"]
[null,"YubaCA","Yuba","CA",6,115,3,"B","Hot-Dry"]
[null,"AdamsCO","Adams","CO",8,1,5,"B","Cold"]
[null,"AlamosaCO","Alamosa","CO",8,3,6,"B","Cold"]
[null,"ArapahoeCO","Arapahoe","CO",8,5,5,"B","Cold"]
[null,"ArchuletaCO","Archuleta","CO",8,7,6,"B","Cold"]
[null,"BacaCO","Baca","CO",8,9,4,"B","Mixed-Dry"]
[null,"BentCO","Bent","CO",8,11,5,"B","Cold"]
[null,"BoulderCO","Boulder","CO",8,13,5,"B","Cold"]
[null,"BroomfieldCO","Broomfield","CO",8,14,5,"B","Cold"]
[null,{"$f":"CONCATENATE(C260,D260)","v":"ChaffeeCO"},"Chaffee","CO",8,15,6,"B","Cold"]
[null,"CheyenneCO","Cheyenne","CO",8,17,5,"B","Cold"]
[null,"Clear CreekCO","Clear Creek","CO",8,19,7,"N/A","Very Cold"]
[null,"ConejosCO","Conejos","CO",8,21,6,"B","Cold"]
[null,"CostillaCO","Costilla","CO",8,23,6,"B","Cold"]
[null,"CrowleyCO","Crowley","CO",8,25,5,"B","Cold"]
[null,"CusterCO","Custer","CO",8,27,6,"B","Cold"]
[null,"DeltaCO","Delta","CO",8,29,5,"B","Cold"]
[null,"DenverCO","Denver","CO",8,31,5,"B","Cold"]
[null,"DoloresCO","Dolores","CO",8,33,6,"B","Cold"]
[null,"DouglasCO","Douglas","CO",8,35,5,"B","Cold"]
[null,"EagleCO","Eagle","CO",8,37,6,"B","Cold"]
[null,"El PasoCO","El Paso","CO",8,41,5,"B","Cold"]
[null,"ElbertCO","Elbert","CO",8,39,5,"B","Cold"]
[null,"FremontCO","Fremont","CO",8,43,5,"B","Cold"]
[null,"GarfieldCO","Garfield","CO",8,45,5,"B","Cold"]
[null,"GilpinCO","Gilpin","CO",8,47,5,"B","Cold"]
[null,"GrandCO","Grand","CO",8,49,7,"N/A","Very Cold"]
[null,"GunnisonCO","Gunnison","CO",8,51,7,"N/A","Very Cold"]
[null,"HinsdaleCO","Hinsdale","CO",8,53,7,"N/A","Very Cold"]
[null,"HuerfanoCO","Huerfano","CO",8,55,5,"B","Cold"]
[null,"JacksonCO","Jackson","CO",8,57,7,"N/A","Very Cold"]
[null,"JeffersonCO","Jefferson","CO",8,59,5,"B","Cold"]
[null,"KiowaCO","Kiowa","CO",8,61,5,"B","Cold"]
[null,"Kit CarsonCO","Kit Carson","CO",8,63,5,"B","Cold"]
[null,"La PlataCO","La Plata","CO",8,67,5,"B","Cold"]
[null,"LakeCO","Lake","CO",8,65,7,"N/A","Very Cold"]
[null,"LarimerCO","Larimer","CO",8,69,5,"B","Cold"]
[null,"Las AnimasCO","Las Animas","CO",8,71,4,"B","Mixed-Dry"]
[null,"LincolnCO","Lincoln","CO",8,73,5,"B","Cold"]
[null,"LoganCO","Logan","CO",8,75,5,"B","Cold"]
[null,"MesaCO","Mesa","CO",8,77,5,"B","Cold"]
[null,"MineralCO","Mineral","CO",8,79,7,"N/A","Very Cold"]
[null,"MoffatCO","Moffat","CO",8,81,6,"B","Cold"]
[null,"MontezumaCO","Montezuma","CO",8,83,5,"B","Cold"]
[null,"MontroseCO","Montrose","CO",8,85,5,"B","Cold"]
[null,"MorganCO","Morgan","CO",8,87,5,"B","Cold"]
[null,"OteroCO","Otero","CO",8,89,4,"B","Mixed-Dry"]
[null,"OurayCO","Ouray","CO",8,91,6,"B","Cold"]
[null,"ParkCO","Park","CO",8,93,7,"N/A","Very Cold"]
[null,"PhillipsCO","Phillips","CO",8,95,5,"B","Cold"]
[null,"PitkinCO","Pitkin","CO",8,97,7,"N/A","Very Cold"]
[null,"ProwersCO","Prowers","CO",8,99,5,"B","Cold"]
[null,"PuebloCO","Pueblo","CO",8,101,5,"B","Cold"]
[null,"Rio BlancoCO","Rio Blanco","CO",8,103,6,"B","Cold"]
[null,"Rio GrandeCO","Rio Grande","CO",8,105,7,"N/A","Very Cold"]
[null,"RouttCO","Routt","CO",8,107,7,"N/A","Very Cold"]
[null,"SaguacheCO","Saguache","CO",8,109,6,"B","Cold"]
[null,"San JuanCO","San Juan","CO",8,111,7,"N/A","Very Cold"]
[null,"San MiguelCO","San Miguel","CO",8,113,6,"B","Cold"]
[null,"SedgwickCO","Sedgwick","CO",8,115,5,"B","Cold"]
[null,"SummitCO","Summit","CO",8,117,7,"N/A","Very Cold"]
[null,"TellerCO","Teller","CO",8,119,5,"B","Cold"]
[null,"WashingtonCO","Washington","CO",8,121,5,"B","Cold"]
[null,"WeldCO","Weld","CO",8,123,5,"B","Cold"]
[null,"YumaCO","Yuma","CO",8,125,5,"B","Cold"]
[null,"FairfieldCT","Fairfield","CT",9,1,5,"A","Cold"]
[null,"HartfordCT","Hartford","CT",9,3,5,"A","Cold"]
[null,"LitchfieldCT","Litchfield","CT",9,5,5,"A","Cold"]
[null,"MiddlesexCT","Middlesex","CT",9,7,5,"A","Cold"]
[null,"New HavenCT","New Haven","CT",9,9,5,"A","Cold"]
[null,"New LondonCT","New London","CT",9,11,5,"A","Cold"]
[null,"TollandCT","Tolland","CT",9,13,5,"A","Cold"]
[null,"WindhamCT","Windham","CT",9,15,5,"A","Cold"]
[null,{"$f":"CONCATENATE(C324,D324)","v":"District of ColumbiaDC"},"District of Columbia","DC",11,1,4,"A","Mixed-Humid"]
[null,"KentDE","Kent","DE",10,1,4,"A","Mixed-Humid"]
[null,"New CastleDE","New Castle","DE",10,3,4,"A","Mixed-Humid"]
[null,"SussexDE","Sussex","DE",10,5,4,"A","Mixed-Humid"]
[null,"AlachuaFL","Alachua","FL",12,1,2,"A","Hot-Humid"]
[null,"BakerFL","Baker","FL",12,3,2,"A","Hot-Humid"]
[null,"BayFL","Bay","FL",12,5,2,"A","Hot-Humid"]
[null,"BradfordFL","Bradford","FL",12,7,2,"A","Hot-Humid"]
[null,"BrevardFL","Brevard","FL",12,9,2,"A","Hot-Humid"]
[null,"BrowardFL","Broward","FL",12,11,1,"A","Hot-Humid"]
[null,"CalhounFL","Calhoun","FL",12,13,2,"A","Hot-Humid"]
[null,"CharlotteFL","Charlotte","FL",12,15,2,"A","Hot-Humid"]
[null,"CitrusFL","Citrus","FL",12,17,2,"A","Hot-Humid"]
[null,"ClayFL","Clay","FL",12,19,2,"A","Hot-Humid"]
[null,"CollierFL","Collier","FL",12,21,2,"A","Hot-Humid"]
[null,"ColumbiaFL","Columbia","FL",12,23,2,"A","Hot-Humid"]
[null,"DeSotoFL","DeSoto","FL",12,27,2,"A","Hot-Humid"]
[null,"DixieFL","Dixie","FL",12,29,2,"A","Hot-Humid"]
[null,"DuvalFL","Duval","FL",12,31,2,"A","Hot-Humid"]
[null,"EscambiaFL","Escambia","FL",12,33,2,"A","Hot-Humid"]
[null,"FlaglerFL","Flagler","FL",12,35,2,"A","Hot-Humid"]
[null,"FranklinFL","Franklin","FL",12,37,2,"A","Hot-Humid"]
[null,"GadsdenFL","Gadsden","FL",12,39,2,"A","Hot-Humid"]
[null,"GilchristFL","Gilchrist","FL",12,41,2,"A","Hot-Humid"]
[null,"GladesFL","Glades","FL",12,43,2,"A","Hot-Humid"]
[null,"GulfFL","Gulf","FL",12,45,2,"A","Hot-Humid"]
[null,"HamiltonFL","Hamilton","FL",12,47,2,"A","Hot-Humid"]
[null,"HardeeFL","Hardee","FL",12,49,2,"A","Hot-Humid"]
[null,"HendryFL","Hendry","FL",12,51,2,"A","Hot-Humid"]
[null,"HernandoFL","Hernando","FL",12,53,2,"A","Hot-Humid"]
[null,"HighlandsFL","Highlands","FL",12,55,2,"A","Hot-Humid"]
[null,"HillsboroughFL","Hillsborough","FL",12,57,2,"A","Hot-Humid"]
[null,"HolmesFL","Holmes","FL",12,59,2,"A","Hot-Humid"]
[null,"Indian RiverFL","Indian River","FL",12,61,2,"A","Hot-Humid"]
[null,"JacksonFL","Jackson","FL",12,63,2,"A","Hot-Humid"]
[null,"JeffersonFL","Jefferson","FL",12,65,2,"A","Hot-Humid"]
[null,"LafayetteFL","Lafayette","FL",12,67,2,"A","Hot-Humid"]
[null,"LakeFL","Lake","FL",12,69,2,"A","Hot-Humid"]
[null,"LeeFL","Lee","FL",12,71,2,"A","Hot-Humid"]
[null,"LeonFL","Leon","FL",12,73,2,"A","Hot-Humid"]
[null,"LevyFL","Levy","FL",12,75,2,"A","Hot-Humid"]
[null,"LibertyFL","Liberty","FL",12,77,2,"A","Hot-Humid"]
[null,"MadisonFL","Madison","FL",12,79,2,"A","Hot-Humid"]
[null,"ManateeFL","Manatee","FL",12,81,2,"A","Hot-Humid"]
[null,"MarionFL","Marion","FL",12,83,2,"A","Hot-Humid"]
[null,"MartinFL","Martin","FL",12,85,2,"A","Hot-Humid"]
[null,"Miami-DadeFL","Miami-Dade","FL",12,86,1,"A","Hot-Humid"]
[null,"MonroeFL","Monroe","FL",12,87,1,"A","Hot-Humid"]
[null,"NassauFL","Nassau","FL",12,89,2,"A","Hot-Humid"]
[null,"OkaloosaFL","Okaloosa","FL",12,91,2,"A","Hot-Humid"]
[null,"OkeechobeeFL","Okeechobee","FL",12,93,2,"A","Hot-Humid"]
[null,"OrangeFL","Orange","FL",12,95,2,"A","Hot-Humid"]
[null,"OsceolaFL","Osceola","FL",12,97,2,"A","Hot-Humid"]
[null,"Palm BeachFL","Palm Beach","FL",12,99,2,"A","Hot-Humid"]
[null,"PascoFL","Pasco","FL",12,101,2,"A","Hot-Humid"]
[null,"PinellasFL","Pinellas","FL",12,103,2,"A","Hot-Humid"]
[null,"PolkFL","Polk","FL",12,105,2,"A","Hot-Humid"]
[null,"PutnamFL","Putnam","FL",12,107,2,"A","Hot-Humid"]
[null,"Santa RosaFL","Santa Rosa","FL",12,113,2,"A","Hot-Humid"]
[null,"SarasotaFL","Sarasota","FL",12,115,2,"A","Hot-Humid"]
[null,"SeminoleFL","Seminole","FL",12,117,2,"A","Hot-Humid"]
[null,"St. JohnsFL","St. Johns","FL",12,109,2,"A","Hot-Humid"]
[null,"St. LucieFL","St. Lucie","FL",12,111,2,"A","Hot-Humid"]
[null,"SumterFL","Sumter","FL",12,119,2,"A","Hot-Humid"]
[null,{"$f":"CONCATENATE(C388,D388)","v":"SuwanneeFL"},"Suwannee","FL",12,121,2,"A","Hot-Humid"]
[null,"TaylorFL","Taylor","FL",12,123,2,"A","Hot-Humid"]
[null,"UnionFL","Union","FL",12,125,2,"A","Hot-Humid"]
[null,"VolusiaFL","Volusia","FL",12,127,2,"A","Hot-Humid"]
[null,"WakullaFL","Wakulla","FL",12,129,2,"A","Hot-Humid"]
[null,"WaltonFL","Walton","FL",12,131,2,"A","Hot-Humid"]
[null,"WashingtonFL","Washington","FL",12,133,2,"A","Hot-Humid"]
[null,"ApplingGA","Appling","GA",13,1,2,"A","Hot-Humid"]
[null,"AtkinsonGA","Atkinson","GA",13,3,2,"A","Hot-Humid"]
[null,"BaconGA","Bacon","GA",13,5,2,"A","Hot-Humid"]
[null,"BakerGA","Baker","GA",13,7,2,"A","Hot-Humid"]
[null,"BaldwinGA","Baldwin","GA",13,9,3,"A","Mixed-Humid"]
[null,"BanksGA","Banks","GA",13,11,4,"A","Mixed-Humid"]
[null,"BarrowGA","Barrow","GA",13,13,3,"A","Mixed-Humid"]
[null,"BartowGA","Bartow","GA",13,15,3,"A","Mixed-Humid"]
[null,"Ben HillGA","Ben Hill","GA",13,17,3,"A","Hot-Humid"]
[null,"BerrienGA","Berrien","GA",13,19,2,"A","Hot-Humid"]
[null,"BibbGA","Bibb","GA",13,21,3,"A","Mixed-Humid"]
[null,"BleckleyGA","Bleckley","GA",13,23,3,"A","Hot-Humid"]
[null,"BrantleyGA","Brantley","GA",13,25,2,"A","Hot-Humid"]
[null,"BrooksGA","Brooks","GA",13,27,2,"A","Hot-Humid"]
[null,"BryanGA","Bryan","GA",13,29,2,"A","Hot-Humid"]
[null,"BullochGA","Bulloch","GA",13,31,3,"A","Hot-Humid"]
[null,"BurkeGA","Burke","GA",13,33,3,"A","Mixed-Humid"]
[null,"ButtsGA","Butts","GA",13,35,3,"A","Mixed-Humid"]
[null,"CalhounGA","Calhoun","GA",13,37,3,"A","Hot-Humid"]
[null,"CamdenGA","Camden","GA",13,39,2,"A","Hot-Humid"]
[null,"CandlerGA","Candler","GA",13,43,3,"A","Hot-Humid"]
[null,"CarrollGA","Carroll","GA",13,45,3,"A","Mixed-Humid"]
[null,"CatoosaGA","Catoosa","GA",13,47,4,"A","Mixed-Humid"]
[null,"CharltonGA","Charlton","GA",13,49,2,"A","Hot-Humid"]
[null,"ChathamGA","Chatham","GA",13,51,2,"A","Hot-Humid"]
[null,"ChattahoocheeGA","Chattahoochee","GA",13,53,3,"A","Hot-Humid"]
[null,"ChattoogaGA","Chattooga","GA",13,55,4,"A","Mixed-Humid"]
[null,"CherokeeGA","Cherokee","GA",13,57,3,"A","Mixed-Humid"]
[null,"ClarkeGA","Clarke","GA",13,59,3,"A","Mixed-Humid"]
[null,"ClayGA","Clay","GA",13,61,3,"A","Hot-Humid"]
[null,"ClaytonGA","Clayton","GA",13,63,3,"A","Mixed-Humid"]
[null,"ClinchGA","Clinch","GA",13,65,2,"A","Hot-Humid"]
[null,"CobbGA","Cobb","GA",13,67,3,"A","Mixed-Humid"]
[null,"CoffeeGA","Coffee","GA",13,69,3,"A","Hot-Humid"]
[null,"ColquittGA","Colquitt","GA",13,71,2,"A","Hot-Humid"]
[null,"ColumbiaGA","Columbia","GA",13,73,3,"A","Mixed-Humid"]
[null,"CookGA","Cook","GA",13,75,2,"A","Hot-Humid"]
[null,"CowetaGA","Coweta","GA",13,77,3,"A","Mixed-Humid"]
[null,"CrawfordGA","Crawford","GA",13,79,3,"A","Mixed-Humid"]
[null,"CrispGA","Crisp","GA",13,81,3,"A","Hot-Humid"]
[null,"DadeGA","Dade","GA",13,83,4,"A","Mixed-Humid"]
[null,"DawsonGA","Dawson","GA",13,85,4,"A","Mixed-Humid"]
[null,"DecaturGA","Decatur","GA",13,87,2,"A","Hot-Humid"]
[null,"DeKalbGA","DeKalb","GA",13,89,3,"A","Mixed-Humid"]
[null,"DodgeGA","Dodge","GA",13,91,3,"A","Hot-Humid"]
[null,"DoolyGA","Dooly","GA",13,93,3,"A","Hot-Humid"]
[null,"DoughertyGA","Dougherty","GA",13,95,3,"A","Hot-Humid"]
[null,"DouglasGA","Douglas","GA",13,97,3,"A","Mixed-Humid"]
[null,"EarlyGA","Early","GA",13,99,3,"A","Hot-Humid"]
[null,"EcholsGA","Echols","GA",13,101,2,"A","Hot-Humid"]
[null,"EffinghamGA","Effingham","GA",13,103,2,"A","Hot-Humid"]
[null,"ElbertGA","Elbert","GA",13,105,3,"A","Mixed-Humid"]
[null,"EmanuelGA","Emanuel","GA",13,107,3,"A","Hot-Humid"]
[null,"EvansGA","Evans","GA",13,109,2,"A","Hot-Humid"]
[null,"FanninGA","Fannin","GA",13,111,4,"A","Mixed-Humid"]
[null,"FayetteGA","Fayette","GA",13,113,3,"A","Mixed-Humid"]
[null,"FloydGA","Floyd","GA",13,115,4,"A","Mixed-Humid"]
[null,{"$f":"CONCATENATE(C452,D452)","v":"ForsythGA"},"Forsyth","GA",13,117,3,"A","Mixed-Humid"]
[null,"FranklinGA","Franklin","GA",13,119,4,"A","Mixed-Humid"]
[null,"FultonGA","Fulton","GA",13,121,3,"A","Mixed-Humid"]
[null,"GilmerGA","Gilmer","GA",13,123,4,"A","Mixed-Humid"]
[null,"GlascockGA","Glascock","GA",13,125,3,"A","Mixed-Humid"]
[null,"GlynnGA","Glynn","GA",13,127,2,"A","Hot-Humid"]
[null,"GordonGA","Gordon","GA",13,129,4,"A","Mixed-Humid"]
[null,"GradyGA","Grady","GA",13,131,2,"A","Hot-Humid"]
[null,"GreeneGA","Greene","GA",13,133,3,"A","Mixed-Humid"]
[null,"GwinnettGA","Gwinnett","GA",13,135,3,"A","Mixed-Humid"]
[null,"HabershamGA","Habersham","GA",13,137,4,"A","Mixed-Humid"]
[null,"HallGA","Hall","GA",13,139,4,"A","Mixed-Humid"]
[null,"HancockGA","Hancock","GA",13,141,3,"A","Mixed-Humid"]
[null,"HaralsonGA","Haralson","GA",13,143,3,"A","Mixed-Humid"]
[null,"HarrisGA","Harris","GA",13,145,3,"A","Mixed-Humid"]
[null,"HartGA","Hart","GA",13,147,3,"A","Mixed-Humid"]
[null,"HeardGA","Heard","GA",13,149,3,"A","Mixed-Humid"]
[null,"HenryGA","Henry","GA",13,151,3,"A","Mixed-Humid"]
[null,"HoustonGA","Houston","GA",13,153,3,"A","Hot-Humid"]
[null,"IrwinGA","Irwin","GA",13,155,3,"A","Hot-Humid"]
[null,"JacksonGA","Jackson","GA",13,157,3,"A","Mixed-Humid"]
[null,"JasperGA","Jasper","GA",13,159,3,"A","Mixed-Humid"]
[null,"Jeff DavisGA","Jeff Davis","GA",13,161,2,"A","Hot-Humid"]
[null,"JeffersonGA","Jefferson","GA",13,163,3,"A","Mixed-Humid"]
[null,"JenkinsGA","Jenkins","GA",13,165,3,"A","Hot-Humid"]
[null,"JohnsonGA","Johnson","GA",13,167,3,"A","Hot-Humid"]
[null,"JonesGA","Jones","GA",13,169,3,"A","Mixed-Humid"]
[null,"LamarGA","Lamar","GA",13,171,3,"A","Mixed-Humid"]
[null,"LanierGA","Lanier","GA",13,173,2,"A","Hot-Humid"]
[null,"LaurensGA","Laurens","GA",13,175,3,"A","Hot-Humid"]
[null,"LeeGA","Lee","GA",13,177,3,"A","Hot-Humid"]
[null,"LibertyGA","Liberty","GA",13,179,2,"A","Hot-Humid"]
[null,"LincolnGA","Lincoln","GA",13,181,3,"A","Mixed-Humid"]
[null,"LongGA","Long","GA",13,183,2,"A","Hot-Humid"]
[null,"LowndesGA","Lowndes","GA",13,185,2,"A","Hot-Humid"]
[null,"LumpkinGA","Lumpkin","GA",13,187,4,"A","Mixed-Humid"]
[null,"MaconGA","Macon","GA",13,193,3,"A","Hot-Humid"]
[null,"MadisonGA","Madison","GA",13,195,3,"A","Mixed-Humid"]
[null,"MarionGA","Marion","GA",13,197,3,"A","Hot-Humid"]
[null,"McDuffieGA","McDuffie","GA",13,189,3,"A","Mixed-Humid"]
[null,"McIntoshGA","McIntosh","GA",13,191,2,"A","Hot-Humid"]
[null,"MeriwetherGA","Meriwether","GA",13,199,3,"A","Mixed-Humid"]
[null,"MillerGA","Miller","GA",13,201,2,"A","Hot-Humid"]
[null,"MitchellGA","Mitchell","GA",13,205,2,"A","Hot-Humid"]
[null,"MonroeGA","Monroe","GA",13,207,3,"A","Mixed-Humid"]
[null,"MontgomeryGA","Montgomery","GA",13,209,3,"A","Hot-Humid"]
[null,"MorganGA","Morgan","GA",13,211,3,"A","Mixed-Humid"]
[null,"MurrayGA","Murray","GA",13,213,4,"A","Mixed-Humid"]
[null,"MuscogeeGA","Muscogee","GA",13,215,3,"A","Mixed-Humid"]
[null,"NewtonGA","Newton","GA",13,217,3,"A","Mixed-Humid"]
[null,"OconeeGA","Oconee","GA",13,219,3,"A","Mixed-Humid"]
[null,"OglethorpeGA","Oglethorpe","GA",13,221,3,"A","Mixed-Humid"]
[null,"PauldingGA","Paulding","GA",13,223,3,"A","Mixed-Humid"]
[null,"PeachGA","Peach","GA",13,225,3,"A","Hot-Humid"]
[null,"PickensGA","Pickens","GA",13,227,4,"A","Mixed-Humid"]
[null,"PierceGA","Pierce","GA",13,229,2,"A","Hot-Humid"]
[null,"PikeGA","Pike","GA",13,231,3,"A","Mixed-Humid"]
[null,"PolkGA","Polk","GA",13,233,3,"A","Mixed-Humid"]
[null,"PulaskiGA","Pulaski","GA",13,235,3,"A","Hot-Humid"]
[null,"PutnamGA","Putnam","GA",13,237,3,"A","Mixed-Humid"]
[null,"QuitmanGA","Quitman","GA",13,239,3,"A","Hot-Humid"]
[null,"RabunGA","Rabun","GA",13,241,4,"A","Mixed-Humid"]
[null,"RandolphGA","Randolph","GA",13,243,3,"A","Hot-Humid"]
[null,"RichmondGA","Richmond","GA",13,245,3,"A","Mixed-Humid"]
[null,{"$f":"CONCATENATE(C516,D516)","v":"RockdaleGA"},"Rockdale","GA",13,247,3,"A","Mixed-Humid"]
[null,"SchleyGA","Schley","GA",13,249,3,"A","Hot-Humid"]
[null,"ScrevenGA","Screven","GA",13,251,3,"A","Hot-Humid"]
[null,"SeminoleGA","Seminole","GA",13,253,2,"A","Hot-Humid"]
[null,"SpaldingGA","Spalding","GA",13,255,3,"A","Mixed-Humid"]
[null,"StephensGA","Stephens","GA",13,257,4,"A","Mixed-Humid"]
[null,"StewartGA","Stewart","GA",13,259,3,"A","Hot-Humid"]
[null,"SumterGA","Sumter","GA",13,261,3,"A","Hot-Humid"]
[null,"TalbotGA","Talbot","GA",13,263,3,"A","Mixed-Humid"]
[null,"TaliaferroGA","Taliaferro","GA",13,265,3,"A","Mixed-Humid"]
[null,"TattnallGA","Tattnall","GA",13,267,2,"A","Hot-Humid"]
[null,"TaylorGA","Taylor","GA",13,269,3,"A","Hot-Humid"]
[null,"TelfairGA","Telfair","GA",13,271,3,"A","Hot-Humid"]
[null,"TerrellGA","Terrell","GA",13,273,3,"A","Hot-Humid"]
[null,"ThomasGA","Thomas","GA",13,275,2,"A","Hot-Humid"]
[null,"TiftGA","Tift","GA",13,277,3,"A","Hot-Humid"]
[null,"ToombsGA","Toombs","GA",13,279,2,"A","Hot-Humid"]
[null,"TownsGA","Towns","GA",13,281,4,"A","Mixed-Humid"]
[null,"TreutlenGA","Treutlen","GA",13,283,3,"A","Hot-Humid"]
[null,"TroupGA","Troup","GA",13,285,3,"A","Mixed-Humid"]
[null,"TurnerGA","Turner","GA",13,287,3,"A","Hot-Humid"]
[null,"TwiggsGA","Twiggs","GA",13,289,3,"A","Hot-Humid"]
[null,"UnionGA","Union","GA",13,291,4,"A","Mixed-Humid"]
[null,"UpsonGA","Upson","GA",13,293,3,"A","Mixed-Humid"]
[null,"WalkerGA","Walker","GA",13,295,4,"A","Mixed-Humid"]
[null,"WaltonGA","Walton","GA",13,297,3,"A","Mixed-Humid"]
[null,"WareGA","Ware","GA",13,299,2,"A","Hot-Humid"]
[null,"WarrenGA","Warren","GA",13,301,3,"A","Mixed-Humid"]
[null,"WashingtonGA","Washington","GA",13,303,3,"A","Mixed-Humid"]
[null,"WayneGA","Wayne","GA",13,305,2,"A","Hot-Humid"]
[null,"WebsterGA","Webster","GA",13,307,3,"A","Hot-Humid"]
[null,"WheelerGA","Wheeler","GA",13,309,3,"A","Hot-Humid"]
[null,"WhiteGA","White","GA",13,311,4,"A","Mixed-Humid"]
[null,"WhitfieldGA","Whitfield","GA",13,313,4,"A","Mixed-Humid"]
[null,"WilcoxGA","Wilcox","GA",13,315,3,"A","Hot-Humid"]
[null,"WilkesGA","Wilkes","GA",13,317,3,"A","Mixed-Humid"]
[null,"WilkinsonGA","Wilkinson","GA",13,319,3,"A","Mixed-Humid"]
[null,"WorthGA","Worth","GA",13,321,3,"A","Hot-Humid"]
[null,"GuamGU","Guam","GU",66,10,1,"A","Hot-Humid"]
[null,"HawaiiHI","Hawaii","HI",15,1,1,"A","Hot-Humid"]
[null,"HonoluluHI","Honolulu","HI",15,3,1,"A","Hot-Humid"]
[null,"KalawaoHI","Kalawao","HI",15,5,1,"A","Hot-Humid"]
[null,"KauaiHI","Kauai","HI",15,7,1,"A","Hot-Humid"]
[null,"MauiHI","Maui","HI",15,9,1,"A","Hot-Humid"]
[null,"AdairIA","Adair","IA",19,1,5,"A","Cold"]
[null,"AdamsIA","Adams","IA",19,3,5,"A","Cold"]
[null,"AllamakeeIA","Allamakee","IA",19,5,6,"A","Cold"]
[null,"AppanooseIA","Appanoose","IA",19,7,5,"A","Cold"]
[null,"AudubonIA","Audubon","IA",19,9,5,"A","Cold"]
[null,"BentonIA","Benton","IA",19,11,5,"A","Cold"]
[null,"Black HawkIA","Black Hawk","IA",19,13,6,"A","Cold"]
[null,"BooneIA","Boone","IA",19,15,5,"A","Cold"]
[null,"BremerIA","Bremer","IA",19,17,6,"A","Cold"]
[null,"BuchananIA","Buchanan","IA",19,19,6,"A","Cold"]
[null,"Buena VistaIA","Buena Vista","IA",19,21,6,"A","Cold"]
[null,"ButlerIA","Butler","IA",19,23,6,"A","Cold"]
[null,"CalhounIA","Calhoun","IA",19,25,6,"A","Cold"]
[null,"CarrollIA","Carroll","IA",19,27,5,"A","Cold"]
[null,"CassIA","Cass","IA",19,29,5,"A","Cold"]
[null,"CedarIA","Cedar","IA",19,31,5,"A","Cold"]
[null,"Cerro GordoIA","Cerro Gordo","IA",19,33,6,"A","Cold"]
[null,"CherokeeIA","Cherokee","IA",19,35,6,"A","Cold"]
[null,"ChickasawIA","Chickasaw","IA",19,37,6,"A","Cold"]
[null,"ClarkeIA","Clarke","IA",19,39,5,"A","Cold"]
[null,{"$f":"CONCATENATE(C580,D580)","v":"ClayIA"},"Clay","IA",19,41,6,"A","Cold"]
[null,"ClaytonIA","Clayton","IA",19,43,6,"A","Cold"]
[null,"ClintonIA","Clinton","IA",19,45,5,"A","Cold"]
[null,"CrawfordIA","Crawford","IA",19,47,6,"A","Cold"]
[null,"DallasIA","Dallas","IA",19,49,5,"A","Cold"]
[null,"DavisIA","Davis","IA",19,51,5,"A","Cold"]
[null,"DecaturIA","Decatur","IA",19,53,5,"A","Cold"]
[null,"DelawareIA","Delaware","IA",19,55,6,"A","Cold"]
[null,"Des MoinesIA","Des Moines","IA",19,57,5,"A","Cold"]
[null,"DickinsonIA","Dickinson","IA",19,59,6,"A","Cold"]
[null,"DubuqueIA","Dubuque","IA",19,61,5,"A","Cold"]
[null,"EmmetIA","Emmet","IA",19,63,6,"A","Cold"]
[null,"FayetteIA","Fayette","IA",19,65,6,"A","Cold"]
[null,"FloydIA","Floyd","IA",19,67,6,"A","Cold"]
[null,"FranklinIA","Franklin","IA",19,69,6,"A","Cold"]
[null,"FremontIA","Fremont","IA",19,71,5,"A","Cold"]
[null,"GreeneIA","Greene","IA",19,73,5,"A","Cold"]
[null,"GrundyIA","Grundy","IA",19,75,6,"A","Cold"]
[null,"GuthrieIA","Guthrie","IA",19,77,5,"A","Cold"]
[null,"HamiltonIA","Hamilton","IA",19,79,6,"A","Cold"]
[null,"HancockIA","Hancock","IA",19,81,6,"A","Cold"]
[null,"HardinIA","Hardin","IA",19,83,6,"A","Cold"]
[null,"HarrisonIA","Harrison","IA",19,85,5,"A","Cold"]
[null,"HenryIA","Henry","IA",19,87,5,"A","Cold"]
[null,"HowardIA","Howard","IA",19,89,6,"A","Cold"]
[null,"HumboldtIA","Humboldt","IA",19,91,6,"A","Cold"]
[null,"IdaIA","Ida","IA",19,93,6,"A","Cold"]
[null,"IowaIA","Iowa","IA",19,95,5,"A","Cold"]
[null,"JacksonIA","Jackson","IA",19,97,5,"A","Cold"]
[null,"JasperIA","Jasper","IA",19,99,5,"A","Cold"]
[null,"JeffersonIA","Jefferson","IA",19,101,5,"A","Cold"]
[null,"JohnsonIA","Johnson","IA",19,103,5,"A","Cold"]
[null,"JonesIA","Jones","IA",19,105,5,"A","Cold"]
[null,"KeokukIA","Keokuk","IA",19,107,5,"A","Cold"]
[null,"KossuthIA","Kossuth","IA",19,109,6,"A","Cold"]
[null,"LeeIA","Lee","IA",19,111,5,"A","Cold"]
[null,"LinnIA","Linn","IA",19,113,5,"A","Cold"]
[null,"LouisaIA","Louisa","IA",19,115,5,"A","Cold"]
[null,"LucasIA","Lucas","IA",19,117,5,"A","Cold"]
[null,"LyonIA","Lyon","IA",19,119,6,"A","Cold"]
[null,"MadisonIA","Madison","IA",19,121,5,"A","Cold"]
[null,"MahaskaIA","Mahaska","IA",19,123,5,"A","Cold"]
[null,"MarionIA","Marion","IA",19,125,5,"A","Cold"]
[null,"MarshallIA","Marshall","IA",19,127,5,"A","Cold"]
[null,"MillsIA","Mills","IA",19,129,5,"A","Cold"]
[null,"MitchellIA","Mitchell","IA",19,131,6,"A","Cold"]
[null,"MononaIA","Monona","IA",19,133,5,"A","Cold"]
[null,"MonroeIA","Monroe","IA",19,135,5,"A","Cold"]
[null,"MontgomeryIA","Montgomery","IA",19,137,5,"A","Cold"]
[null,"MuscatineIA","Muscatine","IA",19,139,5,"A","Cold"]
[null,"O'BrienIA","O'Brien","IA",19,141,6,"A","Cold"]
[null,"OsceolaIA","Osceola","IA",19,143,6,"A","Cold"]
[null,"PageIA","Page","IA",19,145,5,"A","Cold"]
[null,"Palo AltoIA","Palo Alto","IA",19,147,6,"A","Cold"]
[null,"PlymouthIA","Plymouth","IA",19,149,6,"A","Cold"]
[null,"PocahontasIA","Pocahontas","IA",19,151,6,"A","Cold"]
[null,"Polk CountyIA","Polk County","IA",19,153,5,"A","Cold"]
[null,"PottawattamieIA","Pottawattamie","IA",19,155,5,"A","Cold"]
[null,"PoweshiekIA","Poweshiek","IA",19,157,5,"A","Cold"]
[null,"RinggoldIA","Ringgold","IA",19,159,5,"A","Cold"]
[null,"SacIA","Sac","IA",19,161,6,"A","Cold"]
[null,"ScottIA","Scott","IA",19,163,5,"A","Cold"]
[null,"ShelbyIA","Shelby","IA",19,165,5,"A","Cold"]
[null,"SiouxIA","Sioux","IA",19,167,6,"A","Cold"]
[null,{"$f":"CONCATENATE(C644,D644)","v":"StoryIA"},"Story","IA",19,169,5,"A","Cold"]
[null,"TamaIA","Tama","IA",19,171,5,"A","Cold"]
[null,"TaylorIA","Taylor","IA",19,173,5,"A","Cold"]
[null,"UnionIA","Union","IA",19,175,5,"A","Cold"]
[null,"Van BurenIA","Van Buren","IA",19,177,5,"A","Cold"]
[null,"WapelloIA","Wapello","IA",19,179,5,"A","Cold"]
[null,"WarrenIA","Warren","IA",19,181,5,"A","Cold"]
[null,"WashingtonIA","Washington","IA",19,183,5,"A","Cold"]
[null,"WayneIA","Wayne","IA",19,185,5,"A","Cold"]
[null,"WebsterIA","Webster","IA",19,187,6,"A","Cold"]
[null,"WinnebagoIA","Winnebago","IA",19,189,6,"A","Cold"]
[null,"WinneshiekIA","Winneshiek","IA",19,191,6,"A","Cold"]
[null,"WoodburyIA","Woodbury","IA",19,193,5,"A","Cold"]
[null,"WorthIA","Worth","IA",19,195,6,"A","Cold"]
[null,"WrightIA","Wright","IA",19,197,6,"A","Cold"]
[null,"AdaID","Ada","ID",16,1,5,"B","Cold"]
[null,"AdamsID","Adams","ID",16,3,6,"B","Cold"]
[null,"BannockID","Bannock","ID",16,5,6,"B","Cold"]
[null,"Bear LakeID","Bear Lake","ID",16,7,6,"B","Cold"]
[null,"BenewahID","Benewah","ID",16,9,5,"B","Cold"]
[null,"BinghamID","Bingham","ID",16,11,6,"B","Cold"]
[null,"BlaineID","Blaine","ID",16,13,6,"B","Cold"]
[null,"BoiseID","Boise","ID",16,15,6,"B","Cold"]
[null,"BonnerID","Bonner","ID",16,17,6,"B","Cold"]
[null,"BonnevilleID","Bonneville","ID",16,19,6,"B","Cold"]
[null,"BoundaryID","Boundary","ID",16,21,6,"B","Cold"]
[null,"ButteID","Butte","ID",16,23,6,"B","Cold"]
[null,"CamasID","Camas","ID",16,25,6,"B","Cold"]
[null,"CanyonID","Canyon","ID",16,27,5,"B","Cold"]
[null,"CaribouID","Caribou","ID",16,29,6,"B","Cold"]
[null,"CassiaID","Cassia","ID",16,31,5,"B","Cold"]
[null,"ClarkID","Clark","ID",16,33,6,"B","Cold"]
[null,"ClearwaterID","Clearwater","ID",16,35,5,"B","Cold"]
[null,"CusterID","Custer","ID",16,37,6,"B","Cold"]
[null,"ElmoreID","Elmore","ID",16,39,5,"B","Cold"]
[null,"FranklinID","Franklin","ID",16,41,6,"B","Cold"]
[null,"FremontID","Fremont","ID",16,43,6,"B","Cold"]
[null,"GemID","Gem","ID",16,45,5,"B","Cold"]
[null,"GoodingID","Gooding","ID",16,47,5,"B","Cold"]
[null,"IdahoID","Idaho","ID",16,49,5,"B","Cold"]
[null,"JeffersonID","Jefferson","ID",16,51,6,"B","Cold"]
[null,"JeromeID","Jerome","ID",16,53,5,"B","Cold"]
[null,"KootenaiID","Kootenai","ID",16,55,5,"B","Cold"]
[null,"LatahID","Latah","ID",16,57,5,"B","Cold"]
[null,"LemhiID","Lemhi","ID",16,59,6,"B","Cold"]
[null,"LewisID","Lewis","ID",16,61,5,"B","Cold"]
[null,"LincolnID","Lincoln","ID",16,63,5,"B","Cold"]
[null,"MadisonID","Madison","ID",16,65,6,"B","Cold"]
[null,"MinidokaID","Minidoka","ID",16,67,5,"B","Cold"]
[null,"Nez PerceID","Nez Perce","ID",16,69,5,"B","Cold"]
[null,"OneidaID","Oneida","ID",16,71,6,"B","Cold"]
[null,"OwyheeID","Owyhee","ID",16,73,5,"B","Cold"]
[null,"PayetteID","Payette","ID",16,75,5,"B","Cold"]
[null,"PowerID","Power","ID",16,77,5,"B","Cold"]
[null,"ShoshoneID","Shoshone","ID",16,79,5,"B","Cold"]
[null,"TetonID","Teton","ID",16,81,6,"B","Cold"]
[null,"Twin FallsID","Twin Falls","ID",16,83,5,"B","Cold"]
[null,"ValleyID","Valley","ID",16,85,6,"B","Cold"]
[null,"WashingtonID","Washington","ID",16,87,5,"B","Cold"]
[null,"AdamsIL","Adams","IL",17,1,5,"A","Cold"]
[null,"AlexanderIL","Alexander","IL",17,3,4,"A","Mixed-Humid"]
[null,"BondIL","Bond","IL",17,5,4,"A","Mixed-Humid"]
[null,"BooneIL","Boone","IL",17,7,5,"A","Cold"]
[null,"BrownIL","Brown","IL",17,9,5,"A","Cold"]
[null,{"$f":"CONCATENATE(C708,D708)","v":"BureauIL"},"Bureau","IL",17,11,5,"A","Cold"]
[null,"CalhounIL","Calhoun","IL",17,13,5,"A","Cold"]
[null,"CarrollIL","Carroll","IL",17,15,5,"A","Cold"]
[null,"CassIL","Cass","IL",17,17,5,"A","Cold"]
[null,"ChampaignIL","Champaign","IL",17,19,5,"A","Cold"]
[null,"ChristianIL","Christian","IL",17,21,4,"A","Mixed-Humid"]
[null,"ClarkIL","Clark","IL",17,23,5,"A","Cold"]
[null,"ClayIL","Clay","IL",17,25,4,"A","Mixed-Humid"]
[null,"ClintonIL","Clinton","IL",17,27,4,"A","Mixed-Humid"]
[null,"ColesIL","Coles","IL",17,29,5,"A","Cold"]
[null,"CookIL","Cook","IL",17,31,5,"A","Cold"]
[null,"CrawfordIL","Crawford","IL",17,33,4,"A","Mixed-Humid"]
[null,"CumberlandIL","Cumberland","IL",17,35,5,"A","Cold"]
[null,"DeKalbIL","DeKalb","IL",17,37,5,"A","Cold"]
[null,"DeWittIL","DeWitt","IL",17,39,5,"A","Cold"]
[null,"DouglasIL","Douglas","IL",17,41,5,"A","Cold"]
[null,"DuPageIL","DuPage","IL",17,43,5,"A","Cold"]
[null,"EdgarIL","Edgar","IL",17,45,5,"A","Cold"]
[null,"EdwardsIL","Edwards","IL",17,47,4,"A","Mixed-Humid"]
[null,"EffinghamIL","Effingham","IL",17,49,4,"A","Mixed-Humid"]
[null,"FayetteIL","Fayette","IL",17,51,4,"A","Mixed-Humid"]
[null,"FordIL","Ford","IL",17,53,5,"A","Cold"]
[null,"FranklinIL","Franklin","IL",17,55,4,"A","Mixed-Humid"]
[null,"FultonIL","Fulton","IL",17,57,5,"A","Cold"]
[null,"GallatinIL","Gallatin","IL",17,59,4,"A","Mixed-Humid"]
[null,"GreeneIL","Greene","IL",17,61,5,"A","Cold"]
[null,"GrundyIL","Grundy","IL",17,63,5,"A","Cold"]
[null,"HamiltonIL","Hamilton","IL",17,65,4,"A","Mixed-Humid"]
[null,"HancockIL","Hancock","IL",17,67,5,"A","Cold"]
[null,"HardinIL","Hardin","IL",17,69,4,"A","Mixed-Humid"]
[null,"HendersonIL","Henderson","IL",17,71,5,"A","Cold"]
[null,"HenryIL","Henry","IL",17,73,5,"A","Cold"]
[null,"IroquoisIL","Iroquois","IL",17,75,5,"A","Cold"]
[null,"JacksonIL","Jackson","IL",17,77,4,"A","Mixed-Humid"]
[null,"JasperIL","Jasper","IL",17,79,4,"A","Mixed-Humid"]
[null,"JeffersonIL","Jefferson","IL",17,81,4,"A","Mixed-Humid"]
[null,"JerseyIL","Jersey","IL",17,83,5,"A","Cold"]
[null,"Jo DaviessIL","Jo Daviess","IL",17,85,5,"A","Cold"]
[null,"JohnsonIL","Johnson","IL",17,87,4,"A","Mixed-Humid"]
[null,"KaneIL","Kane","IL",17,89,5,"A","Cold"]
[null,"KankakeeIL","Kankakee","IL",17,91,5,"A","Cold"]
[null,"KendallIL","Kendall","IL",17,93,5,"A","Cold"]
[null,"KnoxIL","Knox","IL",17,95,5,"A","Cold"]
[null,"LakeIL","Lake","IL",17,97,5,"A","Cold"]
[null,"LaSalleIL","LaSalle","IL",17,99,5,"A","Cold"]
[null,"LawrenceIL","Lawrence","IL",17,101,4,"A","Mixed-Humid"]
[null,"LeeIL","Lee","IL",17,103,5,"A","Cold"]
[null,"LivingstonIL","Livingston","IL",17,105,5,"A","Cold"]
[null,"LoganIL","Logan","IL",17,107,5,"A","Cold"]
[null,"MaconIL","Macon","IL",17,115,5,"A","Cold"]
[null,"MacoupinIL","Macoupin","IL",17,117,4,"A","Mixed-Humid"]
[null,"MadisonIL","Madison","IL",17,119,4,"A","Mixed-Humid"]
[null,"MarionIL","Marion","IL",17,121,4,"A","Mixed-Humid"]
[null,"MarshallIL","Marshall","IL",17,123,5,"A","Cold"]
[null,"MasonIL","Mason","IL",17,125,5,"A","Cold"]
[null,"MassacIL","Massac","IL",17,127,4,"A","Mixed-Humid"]
[null,"McDonoughIL","McDonough","IL",17,109,5,"A","Cold"]
[null,"McHenryIL","McHenry","IL",17,111,5,"A","Cold"]
[null,"McLeanIL","McLean","IL",17,113,5,"A","Cold"]
[null,"MenardIL","Menard","IL",17,129,5,"A","Cold"]
[null,"MercerIL","Mercer","IL",17,131,5,"A","Cold"]
[null,"MonroeIL","Monroe","IL",17,133,4,"A","Mixed-Humid"]
[null,"MontgomeryIL","Montgomery","IL",17,135,4,"A","Mixed-Humid"]
[null,"MorganIL","Morgan","IL",17,137,5,"A","Cold"]
[null,{"$f":"CONCATENATE(C772,D772)","v":"MoultrieIL"},"Moultrie","IL",17,139,5,"A","Cold"]
[null,"OgleIL","Ogle","IL",17,141,5,"A","Cold"]
[null,"PeoriaIL","Peoria","IL",17,143,5,"A","Cold"]
[null,"PerryIL","Perry","IL",17,145,4,"A","Mixed-Humid"]
[null,"PiattIL","Piatt","IL",17,147,5,"A","Cold"]
[null,"PikeIL","Pike","IL",17,149,5,"A","Cold"]
[null,"PopeIL","Pope","IL",17,151,4,"A","Mixed-Humid"]
[null,"PulaskiIL","Pulaski","IL",17,153,4,"A","Mixed-Humid"]
[null,"PutnamIL","Putnam","IL",17,155,5,"A","Cold"]
[null,"RandolphIL","Randolph","IL",17,157,4,"A","Mixed-Humid"]
[null,"RichlandIL","Richland","IL",17,159,4,"A","Mixed-Humid"]
[null,"Rock IslandIL","Rock Island","IL",17,161,5,"A","Cold"]
[null,"SalineIL","Saline","IL",17,165,4,"A","Mixed-Humid"]
[null,"SangamonIL","Sangamon","IL",17,167,5,"A","Cold"]
[null,"SchuylerIL","Schuyler","IL",17,169,5,"A","Cold"]
[null,"ScottIL","Scott","IL",17,171,5,"A","Cold"]
[null,"ShelbyIL","Shelby","IL",17,173,4,"A","Mixed-Humid"]
[null,"St. ClairIL","St. Clair","IL",17,163,4,"A","Mixed-Humid"]
[null,"StarkIL","Stark","IL",17,175,5,"A","Cold"]
[null,"StephensonIL","Stephenson","IL",17,177,5,"A","Cold"]
[null,"TazewellIL","Tazewell","IL",17,179,5,"A","Cold"]
[null,"UnionIL","Union","IL",17,181,4,"A","Mixed-Humid"]
[null,"VermilionIL","Vermilion","IL",17,183,5,"A","Cold"]
[null,"WabashIL","Wabash","IL",17,185,4,"A","Mixed-Humid"]
[null,"WarrenIL","Warren","IL",17,187,5,"A","Cold"]
[null,"WashingtonIL","Washington","IL",17,189,4,"A","Mixed-Humid"]
[null,"WayneIL","Wayne","IL",17,191,4,"A","Mixed-Humid"]
[null,"WhiteIL","White","IL",17,193,4,"A","Mixed-Humid"]
[null,"WhitesideIL","Whiteside","IL",17,195,5,"A","Cold"]
[null,"WillIL","Will","IL",17,197,5,"A","Cold"]
[null,"WilliamsonIL","Williamson","IL",17,199,4,"A","Mixed-Humid"]
[null,"WinnebagoIL","Winnebago","IL",17,201,5,"A","Cold"]
[null,"WoodfordIL","Woodford","IL",17,203,5,"A","Cold"]
[null,"AdamsIN","Adams","IN",18,1,5,"A","Cold"]
[null,"AllenIN","Allen","IN",18,3,5,"A","Cold"]
[null,"BartholomewIN","Bartholomew","IN",18,5,5,"A","Cold"]
[null,"BentonIN","Benton","IN",18,7,5,"A","Cold"]
[null,"BlackfordIN","Blackford","IN",18,9,5,"A","Cold"]
[null,"BooneIN","Boone","IN",18,11,5,"A","Cold"]
[null,"BrownIN","Brown","IN",18,13,4,"A","Mixed-Humid"]
[null,"CarrollIN","Carroll","IN",18,15,5,"A","Cold"]
[null,"CassIN","Cass","IN",18,17,5,"A","Cold"]
[null,"ClarkIN","Clark","IN",18,19,4,"A","Mixed-Humid"]
[null,"ClayIN","Clay","IN",18,21,5,"A","Cold"]
[null,"ClintonIN","Clinton","IN",18,23,5,"A","Cold"]
[null,"CrawfordIN","Crawford","IN",18,25,4,"A","Mixed-Humid"]
[null,"DaviessIN","Daviess","IN",18,27,4,"A","Mixed-Humid"]
[null,"DearbornIN","Dearborn","IN",18,29,4,"A","Mixed-Humid"]
[null,"DecaturIN","Decatur","IN",18,31,5,"A","Cold"]
[null,"DeKalbIN","DeKalb","IN",18,33,5,"A","Cold"]
[null,"DelawareIN","Delaware","IN",18,35,5,"A","Cold"]
[null,"DuboisIN","Dubois","IN",18,37,4,"A","Mixed-Humid"]
[null,"ElkhartIN","Elkhart","IN",18,39,5,"A","Cold"]
[null,"FayetteIN","Fayette","IN",18,41,5,"A","Cold"]
[null,"FloydIN","Floyd","IN",18,43,4,"A","Mixed-Humid"]
[null,"FountainIN","Fountain","IN",18,45,5,"A","Cold"]
[null,"FranklinIN","Franklin","IN",18,47,5,"A","Cold"]
[null,"FultonIN","Fulton","IN",18,49,5,"A","Cold"]
[null,"GibsonIN","Gibson","IN",18,51,4,"A","Mixed-Humid"]
[null,"GrantIN","Grant","IN",18,53,5,"A","Cold"]
[null,"GreeneIN","Greene","IN",18,55,4,"A","Mixed-Humid"]
[null,"HamiltonIN","Hamilton","IN",18,57,5,"A","Cold"]
[null,"HancockIN","Hancock","IN",18,59,5,"A","Cold"]
[null,"HarrisonIN","Harrison","IN",18,61,4,"A","Mixed-Humid"]
[null,{"$f":"CONCATENATE(C836,D836)","v":"HendricksIN"},"Hendricks","IN",18,63,5,"A","Cold"]
[null,"HenryIN","Henry","IN",18,65,5,"A","Cold"]
[null,"HowardIN","Howard","IN",18,67,5,"A","Cold"]
[null,"HuntingtonIN","Huntington","IN",18,69,5,"A","Cold"]
[null,"JacksonIN","Jackson","IN",18,71,4,"A","Mixed-Humid"]
[null,"JasperIN","Jasper","IN",18,73,5,"A","Cold"]
[null,"JayIN","Jay","IN",18,75,5,"A","Cold"]
[null,"JeffersonIN","Jefferson","IN",18,77,4,"A","Mixed-Humid"]
[null,"JenningsIN","Jennings","IN",18,79,4,"A","Mixed-Humid"]
[null,"JohnsonIN","Johnson","IN",18,81,5,"A","Cold"]
[null,"KnoxIN","Knox","IN",18,83,4,"A","Mixed-Humid"]
[null,"KosciuskoIN","Kosciusko","IN",18,85,5,"A","Cold"]
[null,"LaGrangeIN","LaGrange","IN",18,87,5,"A","Cold"]
[null,"LakeIN","Lake","IN",18,89,5,"A","Cold"]
[null,"LaPorteIN","LaPorte","IN",18,91,5,"A","Cold"]
[null,"LawrenceIN","Lawrence","IN",18,93,4,"A","Mixed-Humid"]
[null,"MadisonIN","Madison","IN",18,95,5,"A","Cold"]
[null,"MarionIN","Marion","IN",18,97,5,"A","Cold"]
[null,"MarshallIN","Marshall","IN",18,99,5,"A","Cold"]
[null,"MartinIN","Martin","IN",18,101,4,"A","Mixed-Humid"]
[null,"MiamiIN","Miami","IN",18,103,5,"A","Cold"]
[null,"MonroeIN","Monroe","IN",18,105,4,"A","Mixed-Humid"]
[null,"MontgomeryIN","Montgomery","IN",18,107,5,"A","Cold"]
[null,"MorganIN","Morgan","IN",18,109,5,"A","Cold"]
[null,"NewtonIN","Newton","IN",18,111,5,"A","Cold"]
[null,"NobleIN","Noble","IN",18,113,5,"A","Cold"]
[null,"OhioIN","Ohio","IN",18,115,4,"A","Mixed-Humid"]
[null,"OrangeIN","Orange","IN",18,117,4,"A","Mixed-Humid"]
[null,"OwenIN","Owen","IN",18,119,5,"A","Cold"]
[null,"ParkeIN","Parke","IN",18,121,5,"A","Cold"]
[null,"PerryIN","Perry","IN",18,123,4,"A","Mixed-Humid"]
[null,"PikeIN","Pike","IN",18,125,4,"A","Mixed-Humid"]
[null,"PorterIN","Porter","IN",18,127,5,"A","Cold"]
[null,"PoseyIN","Posey","IN",18,129,4,"A","Mixed-Humid"]
[null,"PulaskiIN","Pulaski","IN",18,131,5,"A","Cold"]
[null,"PutnamIN","Putnam","IN",18,133,5,"A","Cold"]
[null,"RandolphIN","Randolph","IN",18,135,5,"A","Cold"]
[null,"RipleyIN","Ripley","IN",18,137,4,"A","Mixed-Humid"]
[null,"RushIN","Rush","IN",18,139,5,"A","Cold"]
[null,"ScottIN","Scott","IN",18,143,4,"A","Mixed-Humid"]
[null,"ShelbyIN","Shelby","IN",18,145,5,"A","Cold"]
[null,"SpencerIN","Spencer","IN",18,147,4,"A","Mixed-Humid"]
[null,"St. JosephIN","St. Joseph","IN",18,141,5,"A","Cold"]
[null,"StarkeIN","Starke","IN",18,149,5,"A","Cold"]
[null,"SteubenIN","Steuben","IN",18,151,5,"A","Cold"]
[null,"SullivanIN","Sullivan","IN",18,153,4,"A","Mixed-Humid"]
[null,"SwitzerlandIN","Switzerland","IN",18,155,4,"A","Mixed-Humid"]
[null,"TippecanoeIN","Tippecanoe","IN",18,157,5,"A","Cold"]
[null,"TiptonIN","Tipton","IN",18,159,5,"A","Cold"]
[null,"UnionIN","Union","IN",18,161,5,"A","Cold"]
[null,"VanderburghIN","Vanderburgh","IN",18,163,4,"A","Mixed-Humid"]
[null,"VermillionIN","Vermillion","IN",18,165,5,"A","Cold"]
[null,"VigoIN","Vigo","IN",18,167,5,"A","Cold"]
[null,"WabashIN","Wabash","IN",18,169,5,"A","Cold"]
[null,"WarrenIN","Warren","IN",18,171,5,"A","Cold"]
[null,"WarrickIN","Warrick","IN",18,173,4,"A","Mixed-Humid"]
[null,"WashingtonIN","Washington","IN",18,175,4,"A","Mixed-Humid"]
[null,"WayneIN","Wayne","IN",18,177,5,"A","Cold"]
[null,"WellsIN","Wells","IN",18,179,5,"A","Cold"]
[null,"WhiteIN","White","IN",18,181,5,"A","Cold"]
[null,"WhitleyIN","Whitley","IN",18,183,5,"A","Cold"]
[null,"AllenKS","Allen","KS",20,1,4,"A","Mixed-Humid"]
[null,"AndersonKS","Anderson","KS",20,3,4,"A","Mixed-Humid"]
[null,"AtchisonKS","Atchison","KS",20,5,4,"A","Mixed-Humid"]
[null,{"$f":"CONCATENATE(C900,D900)","v":"BarberKS"},"Barber","KS",20,7,4,"A","Mixed-Humid"]
[null,"BartonKS","Barton","KS",20,9,4,"A","Mixed-Humid"]
[null,"BourbonKS","Bourbon","KS",20,11,4,"A","Mixed-Humid"]
[null,"BrownKS","Brown","KS",20,13,4,"A","Mixed-Humid"]
[null,"ButlerKS","Butler","KS",20,15,4,"A","Mixed-Humid"]
[null,"ChaseKS","Chase","KS",20,17,4,"A","Mixed-Humid"]
[null,"ChautauquaKS","Chautauqua","KS",20,19,4,"A","Mixed-Humid"]
[null,"CherokeeKS","Cherokee","KS",20,21,4,"A","Mixed-Humid"]
[null,"CheyenneKS","Cheyenne","KS",20,23,5,"A","Cold"]
[null,"ClarkKS","Clark","KS",20,25,4,"A","Mixed-Humid"]
[null,"ClayKS","Clay","KS",20,27,4,"A","Mixed-Humid"]
[null,"CloudKS","Cloud","KS",20,29,5,"A","Cold"]
[null,"CoffeyKS","Coffey","KS",20,31,4,"A","Mixed-Humid"]
[null,"ComancheKS","Comanche","KS",20,33,4,"A","Mixed-Humid"]
[null,"CowleyKS","Cowley","KS",20,35,4,"A","Mixed-Humid"]
[null,"CrawfordKS","Crawford","KS",20,37,4,"A","Mixed-Humid"]
[null,"DecaturKS","Decatur","KS",20,39,5,"A","Cold"]
[null,"DickinsonKS","Dickinson","KS",20,41,4,"A","Mixed-Humid"]
[null,"DoniphanKS","Doniphan","KS",20,43,4,"A","Mixed-Humid"]
[null,"DouglasKS","Douglas","KS",20,45,4,"A","Mixed-Humid"]
[null,"EdwardsKS","Edwards","KS",20,47,4,"A","Mixed-Humid"]
[null,"ElkKS","Elk","KS",20,49,4,"A","Mixed-Humid"]
[null,"EllisKS","Ellis","KS",20,51,5,"A","Cold"]
[null,"EllsworthKS","Ellsworth","KS",20,53,4,"A","Mixed-Humid"]
[null,"FinneyKS","Finney","KS",20,55,4,"A","Mixed-Humid"]
[null,"FordKS","Ford","KS",20,57,4,"A","Mixed-Humid"]
[null,"FranklinKS","Franklin","KS",20,59,4,"A","Mixed-Humid"]
[null,"GearyKS","Geary","KS",20,61,4,"A","Mixed-Humid"]
[null,"GoveKS","Gove","KS",20,63,5,"A","Cold"]
[null,"GrahamKS","Graham","KS",20,65,5,"A","Cold"]
[null,"GrantKS","Grant","KS",20,67,4,"A","Mixed-Humid"]
[null,"GrayKS","Gray","KS",20,69,4,"A","Mixed-Humid"]
[null,"GreeleyKS","Greeley","KS",20,71,5,"A","Cold"]
[null,"GreenwoodKS","Greenwood","KS",20,73,4,"A","Mixed-Humid"]
[null,"HamiltonKS","Hamilton","KS",20,75,5,"A","Cold"]
[null,"HarperKS","Harper","KS",20,77,4,"A","Mixed-Humid"]
[null,"HarveyKS","Harvey","KS",20,79,4,"A","Mixed-Humid"]
[null,"HaskellKS","Haskell","KS",20,81,4,"A","Mixed-Humid"]
[null,"HodgemanKS","Hodgeman","KS",20,83,4,"A","Mixed-Humid"]
[null,"JacksonKS","Jackson","KS",20,85,4,"A","Mixed-Humid"]
[null,"JeffersonKS","Jefferson","KS",20,87,4,"A","Mixed-Humid"]
[null,"JewellKS","Jewell","KS",20,89,5,"A","Cold"]
[null,"JohnsonKS","Johnson","KS",20,91,4,"A","Mixed-Humid"]
[null,"KearnyKS","Kearny","KS",20,93,4,"A","Mixed-Humid"]
[null,"KingmanKS","Kingman","KS",20,95,4,"A","Mixed-Humid"]
[null,"KiowaKS","Kiowa","KS",20,97,4,"A","Mixed-Humid"]
[null,"LabetteKS","Labette","KS",20,99,4,"A","Mixed-Humid"]
[null,"LaneKS","Lane","KS",20,101,5,"A","Cold"]
[null,"LeavenworthKS","Leavenworth","KS",20,103,4,"A","Mixed-Humid"]
[null,"LincolnKS","Lincoln","KS",20,105,4,"A","Mixed-Humid"]
[null,"LinnKS","Linn","KS",20,107,4,"A","Mixed-Humid"]
[null,"LoganKS","Logan","KS",20,109,5,"A","Cold"]
[null,"LyonKS","Lyon","KS",20,111,4,"A","Mixed-Humid"]
[null,"McPhersonKS","McPherson","KS",20,113,4,"A","Mixed-Humid"]
[null,"MarionKS","Marion","KS",20,115,4,"A","Mixed-Humid"]
[null,"MarshallKS","Marshall","KS",20,117,4,"A","Mixed-Humid"]
[null,"MeadeKS","Meade","KS",20,119,4,"A","Mixed-Humid"]
[null,"MiamiKS","Miami","KS",20,121,4,"A","Mixed-Humid"]
[null,"MitchellKS","Mitchell","KS",20,123,5,"A","Cold"]
[null,"MontgomeryKS","Montgomery","KS",20,125,4,"A","Mixed-Humid"]
[null,"MorrisKS","Morris","KS",20,127,4,"A","Mixed-Humid"]
[null,"MortonKS","Morton","KS",20,129,4,"A","Mixed-Humid"]
[null,"NemahaKS","Nemaha","KS",20,131,4,"A","Mixed-Humid"]
[null,"NeoshoKS","Neosho","KS",20,133,4,"A","Mixed-Humid"]
[null,{"$f":"CONCATENATE(C964,D964)","v":"NessKS"},"Ness","KS",20,135,5,"A","Cold"]
[null,"NortonKS","Norton","KS",20,137,5,"A","Cold"]
[null,"OsageKS","Osage","KS",20,139,4,"A","Mixed-Humid"]
[null,"OsborneKS","Osborne","KS",20,141,5,"A","Cold"]
[null,"OttawaKS","Ottawa","KS",20,143,4,"A","Mixed-Humid"]
[null,"PawneeKS","Pawnee","KS",20,145,4,"A","Mixed-Humid"]
[null,"PhillipsKS","Phillips","KS",20,147,5,"A","Cold"]
[null,"PottawatomieKS","Pottawatomie","KS",20,149,4,"A","Mixed-Humid"]
[null,"PrattKS","Pratt","KS",20,151,4,"A","Mixed-Humid"]
[null,"RawlinsKS","Rawlins","KS",20,153,5,"A","Cold"]
[null,"RenoKS","Reno","KS",20,155,4,"A","Mixed-Humid"]
[null,"RepublicKS","Republic","KS",20,157,5,"A","Cold"]
[null,"RiceKS","Rice","KS",20,159,4,"A","Mixed-Humid"]
[null,"RileyKS","Riley","KS",20,161,4,"A","Mixed-Humid"]
[null,"RooksKS","Rooks","KS",20,163,5,"A","Cold"]
[null,"RushKS","Rush","KS",20,165,4,"A","Mixed-Humid"]
[null,"RussellKS","Russell","KS",20,167,4,"A","Mixed-Humid"]
[null,"SalineKS","Saline","KS",20,169,4,"A","Mixed-Humid"]
[null,"ScottKS","Scott","KS",20,171,5,"A","Cold"]
[null,"SedgwickKS","Sedgwick","KS",20,173,4,"A","Mixed-Humid"]
[null,"SewardKS","Seward","KS",20,175,4,"A","Mixed-Humid"]
[null,"ShawneeKS","Shawnee","KS",20,177,4,"A","Mixed-Humid"]
[null,"SheridanKS","Sheridan","KS",20,179,5,"A","Cold"]
[null,"ShermanKS","Sherman","KS",20,181,5,"A","Cold"]
[null,"SmithKS","Smith","KS",20,183,5,"A","Cold"]
[null,"StaffordKS","Stafford","KS",20,185,4,"A","Mixed-Humid"]
[null,"StantonKS","Stanton","KS",20,187,4,"A","Mixed-Humid"]
[null,"StevensKS","Stevens","KS",20,189,4,"A","Mixed-Humid"]
[null,"SumnerKS","Sumner","KS",20,191,4,"A","Mixed-Humid"]
[null,"ThomasKS","Thomas","KS",20,193,5,"A","Cold"]
[null,"TregoKS","Trego","KS",20,195,5,"A","Cold"]
[null,"WabaunseeKS","Wabaunsee","KS",20,197,4,"A","Mixed-Humid"]
[null,"WallaceKS","Wallace","KS",20,199,5,"A","Cold"]
[null,"WashingtonKS","Washington","KS",20,201,4,"A","Mixed-Humid"]
[null,"WichitaKS","Wichita","KS",20,203,5,"A","Cold"]
[null,"WilsonKS","Wilson","KS",20,205,4,"A","Mixed-Humid"]
[null,"WoodsonKS","Woodson","KS",20,207,4,"A","Mixed-Humid"]
[null,"WyandotteKS","Wyandotte","KS",20,209,4,"A","Mixed-Humid"]
[null,"AdairKY","Adair","KY",21,1,4,"A","Mixed-Humid"]
[null,"AllenKY","Allen","KY",21,3,4,"A","Mixed-Humid"]
[null,"AndersonKY","Anderson","KY",21,5,4,"A","Mixed-Humid"]
[null,"BallardKY","Ballard","KY",21,7,4,"A","Mixed-Humid"]
[null,"BarrenKY","Barren","KY",21,9,4,"A","Mixed-Humid"]
[null,"BathKY","Bath","KY",21,11,4,"A","Mixed-Humid"]
[null,"BellKY","Bell","KY",21,13,4,"A","Mixed-Humid"]
[null,"BooneKY","Boone","KY",21,15,4,"A","Mixed-Humid"]
[null,"BourbonKY","Bourbon","KY",21,17,4,"A","Mixed-Humid"]
[null,"BoydKY","Boyd","KY",21,19,4,"A","Mixed-Humid"]
[null,"BoyleKY","Boyle","KY",21,21,4,"A","Mixed-Humid"]
[null,"BrackenKY","Bracken","KY",21,23,4,"A","Mixed-Humid"]
[null,"BreathittKY","Breathitt","KY",21,25,4,"A","Mixed-Humid"]
[null,"BreckinridgeKY","Breckinridge","KY",21,27,4,"A","Mixed-Humid"]
[null,"BullittKY","Bullitt","KY",21,29,4,"A","Mixed-Humid"]
[null,"ButlerKY","Butler","KY",21,31,4,"A","Mixed-Humid"]
[null,"CaldwellKY","Caldwell","KY",21,33,4,"A","Mixed-Humid"]
[null,"CallowayKY","Calloway","KY",21,35,4,"A","Mixed-Humid"]
[null,"CampbellKY","Campbell","KY",21,37,4,"A","Mixed-Humid"]
[null,"CarlisleKY","Carlisle","KY",21,39,4,"A","Mixed-Humid"]
[null,"CarrollKY","Carroll","KY",21,41,4,"A","Mixed-Humid"]
[null,"CarterKY","Carter","KY",21,43,4,"A","Mixed-Humid"]
[null,"CaseyKY","Casey","KY",21,45,4,"A","Mixed-Humid"]
[null,"ChristianKY","Christian","KY",21,47,4,"A","Mixed-Humid"]
[null,"ClarkKY","Clark","KY",21,49,4,"A","Mixed-Humid"]
[null,"ClayKY","Clay","KY",21,51,4,"A","Mixed-Humid"]
[null,{"$f":"CONCATENATE(C1028,D1028)","v":"ClintonKY"},"Clinton","KY",21,53,4,"A","Mixed-Humid"]
[null,"CrittendenKY","Crittenden","KY",21,55,4,"A","Mixed-Humid"]
[null,"CumberlandKY","Cumberland","KY",21,57,4,"A","Mixed-Humid"]
[null,"DaviessKY","Daviess","KY",21,59,4,"A","Mixed-Humid"]
[null,"EdmonsonKY","Edmonson","KY",21,61,4,"A","Mixed-Humid"]
[null,"ElliottKY","Elliott","KY",21,63,4,"A","Mixed-Humid"]
[null,"EstillKY","Estill","KY",21,65,4,"A","Mixed-Humid"]
[null,"FayetteKY","Fayette","KY",21,67,4,"A","Mixed-Humid"]
[null,"FlemingKY","Fleming","KY",21,69,4,"A","Mixed-Humid"]
[null,"FloydKY","Floyd","KY",21,71,4,"A","Mixed-Humid"]
[null,"FranklinKY","Franklin","KY",21,73,4,"A","Mixed-Humid"]
[null,"FultonKY","Fulton","KY",21,75,4,"A","Mixed-Humid"]
[null,"GallatinKY","Gallatin","KY",21,77,4,"A","Mixed-Humid"]
[null,"GarrardKY","Garrard","KY",21,79,4,"A","Mixed-Humid"]
[null,"GrantKY","Grant","KY",21,81,4,"A","Mixed-Humid"]
[null,"GravesKY","Graves","KY",21,83,4,"A","Mixed-Humid"]
[null,"GraysonKY","Grayson","KY",21,85,4,"A","Mixed-Humid"]
[null,"GreenKY","Green","KY",21,87,4,"A","Mixed-Humid"]
[null,"GreenupKY","Greenup","KY",21,89,4,"A","Mixed-Humid"]
[null,"HancockKY","Hancock","KY",21,91,4,"A","Mixed-Humid"]
[null,"HardinKY","Hardin","KY",21,93,4,"A","Mixed-Humid"]
[null,"HarlanKY","Harlan","KY",21,95,4,"A","Mixed-Humid"]
[null,"HarrisonKY","Harrison","KY",21,97,4,"A","Mixed-Humid"]
[null,"HartKY","Hart","KY",21,99,4,"A","Mixed-Humid"]
[null,"HendersonKY","Henderson","KY",21,101,4,"A","Mixed-Humid"]
[null,"HenryKY","Henry","KY",21,103,4,"A","Mixed-Humid"]
[null,"HickmanKY","Hickman","KY",21,105,4,"A","Mixed-Humid"]
[null,"HopkinsKY","Hopkins","KY",21,107,4,"A","Mixed-Humid"]
[null,"JacksonKY","Jackson","KY",21,109,4,"A","Mixed-Humid"]
[null,"JeffersonKY","Jefferson","KY",21,111,4,"A","Mixed-Humid"]
[null,"JessamineKY","Jessamine","KY",21,113,4,"A","Mixed-Humid"]
[null,"JohnsonKY","Johnson","KY",21,115,4,"A","Mixed-Humid"]
[null,"KentonKY","Kenton","KY",21,117,4,"A","Mixed-Humid"]
[null,"KnottKY","Knott","KY",21,119,4,"A","Mixed-Humid"]
[null,"KnoxKY","Knox","KY",21,121,4,"A","Mixed-Humid"]
[null,"LarueKY","Larue","KY",21,123,4,"A","Mixed-Humid"]
[null,"LaurelKY","Laurel","KY",21,125,4,"A","Mixed-Humid"]
[null,"LawrenceKY","Lawrence","KY",21,127,4,"A","Mixed-Humid"]
[null,"LeeKY","Lee","KY",21,129,4,"A","Mixed-Humid"]
[null,"LeslieKY","Leslie","KY",21,131,4,"A","Mixed-Humid"]
[null,"LetcherKY","Letcher","KY",21,133,4,"A","Mixed-Humid"]
[null,"LewisKY","Lewis","KY",21,135,4,"A","Mixed-Humid"]
[null,"LincolnKY","Lincoln","KY",21,137,4,"A","Mixed-Humid"]
[null,"LivingstonKY","Livingston","KY",21,139,4,"A","Mixed-Humid"]
[null,"LoganKY","Logan","KY",21,141,4,"A","Mixed-Humid"]
[null,"LyonKY","Lyon","KY",21,143,4,"A","Mixed-Humid"]
[null,"McCrackenKY","McCracken","KY",21,145,4,"A","Mixed-Humid"]
[null,"McCrearyKY","McCreary","KY",21,147,4,"A","Mixed-Humid"]
[null,"McLeanKY","McLean","KY",21,149,4,"A","Mixed-Humid"]
[null,"MadisonKY","Madison","KY",21,151,4,"A","Mixed-Humid"]
[null,"MagoffinKY","Magoffin","KY",21,153,4,"A","Mixed-Humid"]
[null,"MarionKY","Marion","KY",21,155,4,"A","Mixed-Humid"]
[null,"MarshallKY","Marshall","KY",21,157,4,"A","Mixed-Humid"]
[null,"MartinKY","Martin","KY",21,159,4,"A","Mixed-Humid"]
[null,"MasonKY","Mason","KY",21,161,4,"A","Mixed-Humid"]
[null,"MeadeKY","Meade","KY",21,163,4,"A","Mixed-Humid"]
[null,"MenifeeKY","Menifee","KY",21,165,4,"A","Mixed-Humid"]
[null,"MercerKY","Mercer","KY",21,167,4,"A","Mixed-Humid"]
[null,"MetcalfeKY","Metcalfe","KY",21,169,4,"A","Mixed-Humid"]
[null,"MonroeKY","Monroe","KY",21,171,4,"A","Mixed-Humid"]
[null,"MontgomeryKY","Montgomery","KY",21,173,4,"A","Mixed-Humid"]
[null,"MorganKY","Morgan","KY",21,175,4,"A","Mixed-Humid"]
[null,"MuhlenbergKY","Muhlenberg","KY",21,177,4,"A","Mixed-Humid"]
[null,"NelsonKY","Nelson","KY",21,179,4,"A","Mixed-Humid"]
[null,{"$f":"CONCATENATE(C1092,D1092)","v":"NicholasKY"},"Nicholas","KY",21,181,4,"A","Mixed-Humid"]
[null,"OhioKY","Ohio","KY",21,183,4,"A","Mixed-Humid"]
[null,"OldhamKY","Oldham","KY",21,185,4,"A","Mixed-Humid"]
[null,"OwenKY","Owen","KY",21,187,4,"A","Mixed-Humid"]
[null,"OwsleyKY","Owsley","KY",21,189,4,"A","Mixed-Humid"]
[null,"PendletonKY","Pendleton","KY",21,191,4,"A","Mixed-Humid"]
[null,"PerryKY","Perry","KY",21,193,4,"A","Mixed-Humid"]
[null,"PikeKY","Pike","KY",21,195,4,"A","Mixed-Humid"]
[null,"PowellKY","Powell","KY",21,197,4,"A","Mixed-Humid"]
[null,"PulaskiKY","Pulaski","KY",21,199,4,"A","Mixed-Humid"]
[null,"RobertsonKY","Robertson","KY",21,201,4,"A","Mixed-Humid"]
[null,"RockcastleKY","Rockcastle","KY",21,203,4,"A","Mixed-Humid"]
[null,"RowanKY","Rowan","KY",21,205,4,"A","Mixed-Humid"]
[null,"RussellKY","Russell","KY",21,207,4,"A","Mixed-Humid"]
[null,"ScottKY","Scott","KY",21,209,4,"A","Mixed-Humid"]
[null,"ShelbyKY","Shelby","KY",21,211,4,"A","Mixed-Humid"]
[null,"SimpsonKY","Simpson","KY",21,213,4,"A","Mixed-Humid"]
[null,"SpencerKY","Spencer","KY",21,215,4,"A","Mixed-Humid"]
[null,"TaylorKY","Taylor","KY",21,217,4,"A","Mixed-Humid"]
[null,"ToddKY","Todd","KY",21,219,4,"A","Mixed-Humid"]
[null,"TriggKY","Trigg","KY",21,221,4,"A","Mixed-Humid"]
[null,"TrimbleKY","Trimble","KY",21,223,4,"A","Mixed-Humid"]
[null,"UnionKY","Union","KY",21,225,4,"A","Mixed-Humid"]
[null,"WarrenKY","Warren","KY",21,227,4,"A","Mixed-Humid"]
[null,"WashingtonKY","Washington","KY",21,229,4,"A","Mixed-Humid"]
[null,"WayneKY","Wayne","KY",21,231,4,"A","Mixed-Humid"]
[null,"WebsterKY","Webster","KY",21,233,4,"A","Mixed-Humid"]
[null,"WhitleyKY","Whitley","KY",21,235,4,"A","Mixed-Humid"]
[null,"WolfeKY","Wolfe","KY",21,237,4,"A","Mixed-Humid"]
[null,"WoodfordKY","Woodford","KY",21,239,4,"A","Mixed-Humid"]
[null,"AcadiaLA","Acadia","LA",22,1,2,"A","Hot-Humid"]
[null,"AllenLA","Allen","LA",22,3,2,"A","Hot-Humid"]
[null,"AscensionLA","Ascension","LA",22,5,2,"A","Hot-Humid"]
[null,"AssumptionLA","Assumption","LA",22,7,2,"A","Hot-Humid"]
[null,"AvoyellesLA","Avoyelles","LA",22,9,2,"A","Hot-Humid"]
[null,"BeauregardLA","Beauregard","LA",22,11,2,"A","Hot-Humid"]
[null,"BienvilleLA","Bienville","LA",22,13,3,"A","Hot-Humid"]
[null,"BossierLA","Bossier","LA",22,15,3,"A","Hot-Humid"]
[null,"CaddoLA","Caddo","LA",22,17,3,"A","Hot-Humid"]
[null,"CalcasieuLA","Calcasieu","LA",22,19,2,"A","Hot-Humid"]
[null,"CaldwellLA","Caldwell","LA",22,21,3,"A","Hot-Humid"]
[null,"CameronLA","Cameron","LA",22,23,2,"A","Hot-Humid"]
[null,"CatahoulaLA","Catahoula","LA",22,25,3,"A","Hot-Humid"]
[null,"ClaiborneLA","Claiborne","LA",22,27,3,"A","Hot-Humid"]
[null,"ConcordiaLA","Concordia","LA",22,29,3,"A","Hot-Humid"]
[null,"De SotoLA","De Soto","LA",22,31,3,"A","Hot-Humid"]
[null,"East Baton RougeLA","East Baton Rouge","LA",22,33,2,"A","Hot-Humid"]
[null,"East CarrollLA","East Carroll","LA",22,35,3,"A","Mixed-Humid"]
[null,"East FelicianaLA","East Feliciana","LA",22,37,2,"A","Hot-Humid"]
[null,"EvangelineLA","Evangeline","LA",22,39,2,"A","Hot-Humid"]
[null,"FranklinLA","Franklin","LA",22,41,3,"A","Hot-Humid"]
[null,"GrantLA","Grant","LA",22,43,3,"A","Hot-Humid"]
[null,"IberiaLA","Iberia","LA",22,45,2,"A","Hot-Humid"]
[null,"IbervilleLA","Iberville","LA",22,47,2,"A","Hot-Humid"]
[null,"JacksonLA","Jackson","LA",22,49,3,"A","Hot-Humid"]
[null,"JeffersonLA","Jefferson","LA",22,51,2,"A","Hot-Humid"]
[null,"Jefferson DavisLA","Jefferson Davis","LA",22,53,2,"A","Hot-Humid"]
[null,"La SalleLA","La Salle","LA",22,59,3,"A","Hot-Humid"]
[null,"LafayetteLA","Lafayette","LA",22,55,2,"A","Hot-Humid"]
[null,"LafourcheLA","Lafourche","LA",22,57,2,"A","Hot-Humid"]
[null,"LincolnLA","Lincoln","LA",22,61,3,"A","Hot-Humid"]
[null,"LivingstonLA","Livingston","LA",22,63,2,"A","Hot-Humid"]
[null,"MadisonLA","Madison","LA",22,65,3,"A","Hot-Humid"]
[null,"MorehouseLA","Morehouse","LA",22,67,3,"A","Mixed-Humid"]
[null,{"$f":"CONCATENATE(C1156,D1156)","v":"NatchitochesLA"},"Natchitoches","LA",22,69,3,"A","Hot-Humid"]
[null,"OrleansLA","Orleans","LA",22,71,2,"A","Hot-Humid"]
[null,"OuachitaLA","Ouachita","LA",22,73,3,"A","Hot-Humid"]
[null,"PlaqueminesLA","Plaquemines","LA",22,75,2,"A","Hot-Humid"]
[null,"Pointe CoupeeLA","Pointe Coupee","LA",22,77,2,"A","Hot-Humid"]
[null,"RapidesLA","Rapides","LA",22,79,2,"A","Hot-Humid"]
[null,"Red RiverLA","Red River","LA",22,81,3,"A","Hot-Humid"]
[null,"RichlandLA","Richland","LA",22,83,3,"A","Hot-Humid"]
[null,"SabineLA","Sabine","LA",22,85,3,"A","Hot-Humid"]
[null,"St. BernardLA","St. Bernard","LA",22,87,2,"A","Hot-Humid"]
[null,"St. CharlesLA","St. Charles","LA",22,89,2,"A","Hot-Humid"]
[null,"St. HelenaLA","St. Helena","LA",22,91,2,"A","Hot-Humid"]
[null,"St. JamesLA","St. James","LA",22,93,2,"A","Hot-Humid"]
[null,"St. John the BaptistLA","St. John the Baptist","LA",22,95,2,"A","Hot-Humid"]
[null,"St. LandryLA","St. Landry","LA",22,97,2,"A","Hot-Humid"]
[null,"St. MartinLA","St. Martin","LA",22,99,2,"A","Hot-Humid"]
[null,"St. MaryLA","St. Mary","LA",22,101,2,"A","Hot-Humid"]
[null,"St. TammanyLA","St. Tammany","LA",22,103,2,"A","Hot-Humid"]
[null,"TangipahoaLA","Tangipahoa","LA",22,105,2,"A","Hot-Humid"]
[null,"TensasLA","Tensas","LA",22,107,3,"A","Hot-Humid"]
[null,"TerrebonneLA","Terrebonne","LA",22,109,2,"A","Hot-Humid"]
[null,"UnionLA","Union","LA",22,111,3,"A","Hot-Humid"]
[null,"VermilionLA","Vermilion","LA",22,113,2,"A","Hot-Humid"]
[null,"VernonLA","Vernon","LA",22,115,3,"A","Hot-Humid"]
[null,"WashingtonLA","Washington","LA",22,117,2,"A","Hot-Humid"]
[null,"WebsterLA","Webster","LA",22,119,3,"A","Hot-Humid"]
[null,"West Baton RougeLA","West Baton Rouge","LA",22,121,2,"A","Hot-Humid"]
[null,"West CarrollLA","West Carroll","LA",22,123,3,"A","Mixed-Humid"]
[null,"West FelicianaLA","West Feliciana","LA",22,125,2,"A","Hot-Humid"]
[null,"WinnLA","Winn","LA",22,127,3,"A","Hot-Humid"]
[null,"BarnstableMA","Barnstable","MA",25,1,5,"A","Cold"]
[null,"BerkshireMA","Berkshire","MA",25,3,5,"A","Cold"]
[null,"BristolMA","Bristol","MA",25,5,5,"A","Cold"]
[null,"DukesMA","Dukes","MA",25,7,5,"A","Cold"]
[null,"EssexMA","Essex","MA",25,9,5,"A","Cold"]
[null,"FranklinMA","Franklin","MA",25,11,5,"A","Cold"]
[null,"HampdenMA","Hampden","MA",25,13,5,"A","Cold"]
[null,"HampshireMA","Hampshire","MA",25,15,5,"A","Cold"]
[null,"MiddlesexMA","Middlesex","MA",25,17,5,"A","Cold"]
[null,"NantucketMA","Nantucket","MA",25,19,5,"A","Cold"]
[null,"NorfolkMA","Norfolk","MA",25,21,5,"A","Cold"]
[null,"PlymouthMA","Plymouth","MA",25,23,5,"A","Cold"]
[null,"SuffolkMA","Suffolk","MA",25,25,5,"A","Cold"]
[null,"WorcesterMA","Worcester","MA",25,27,5,"A","Cold"]
[null,"AlleganyMD","Allegany","MD",24,1,4,"A","Mixed-Humid"]
[null,"Anne ArundelMD","Anne Arundel","MD",24,3,4,"A","Mixed-Humid"]
[null,"BaltimoreMD","Baltimore","MD",24,5,4,"A","Mixed-Humid"]
[null,"CalvertMD","Calvert","MD",24,9,4,"A","Mixed-Humid"]
[null,"CarolineMD","Caroline","MD",24,11,4,"A","Mixed-Humid"]
[null,"CarrollMD","Carroll","MD",24,13,4,"A","Mixed-Humid"]
[null,"CecilMD","Cecil","MD",24,15,4,"A","Mixed-Humid"]
[null,"CharlesMD","Charles","MD",24,17,4,"A","Mixed-Humid"]
[null,"DorchesterMD","Dorchester","MD",24,19,4,"A","Mixed-Humid"]
[null,"FrederickMD","Frederick","MD",24,21,4,"A","Mixed-Humid"]
[null,"GarrettMD","Garrett","MD",24,23,5,"A","Cold"]
[null,"HarfordMD","Harford","MD",24,25,4,"A","Mixed-Humid"]
[null,"HowardMD","Howard","MD",24,27,4,"A","Mixed-Humid"]
[null,"KentMD","Kent","MD",24,29,4,"A","Mixed-Humid"]
[null,"MontgomeryMD","Montgomery","MD",24,31,4,"A","Mixed-Humid"]
[null,"Prince George'sMD","Prince George's","MD",24,33,4,"A","Mixed-Humid"]
[null,"Queen Anne'sMD","Queen Anne's","MD",24,35,4,"A","Mixed-Humid"]
[null,"St. Mary'sMD","St. Mary's","MD",24,37,4,"A","Mixed-Humid"]
[null,"SomersetMD","Somerset","MD",24,39,4,"A","Mixed-Humid"]
[null,"TalbotMD","Talbot","MD",24,41,4,"A","Mixed-Humid"]
[null,{"$f":"CONCATENATE(C1220,D1220)","v":"WashingtonMD"},"Washington","MD",24,43,4,"A","Mixed-Humid"]
[null,"WicomicoMD","Wicomico","MD",24,45,4,"A","Mixed-Humid"]
[null,"WorcesterMD","Worcester","MD",24,47,4,"A","Mixed-Humid"]
[null,"BaltimoreMD","Baltimore","MD",24,510,4,"A","Mixed-Humid"]
[null,"AndroscogginME","Androscoggin","ME",23,1,6,"A","Cold"]
[null,"AroostookME","Aroostook","ME",23,3,7,"N/A","Very Cold"]
[null,"CumberlandME","Cumberland","ME",23,5,6,"A","Cold"]
[null,"FranklinME","Franklin","ME",23,7,6,"A","Cold"]
[null,"HancockME","Hancock","ME",23,9,6,"A","Cold"]
[null,"KennebecME","Kennebec","ME",23,11,6,"A","Cold"]
[null,"KnoxME","Knox","ME",23,13,6,"A","Cold"]
[null,"LincolnME","Lincoln","ME",23,15,6,"A","Cold"]
[null,"OxfordME","Oxford","ME",23,17,6,"A","Cold"]
[null,"PenobscotME","Penobscot","ME",23,19,6,"A","Cold"]
[null,"PiscataquisME","Piscataquis","ME",23,21,6,"A","Cold"]
[null,"SagadahocME","Sagadahoc","ME",23,23,6,"A","Cold"]
[null,"SomersetME","Somerset","ME",23,25,6,"A","Cold"]
[null,"WaldoME","Waldo","ME",23,27,6,"A","Cold"]
[null,"WashingtonME","Washington","ME",23,29,6,"A","Cold"]
[null,"YorkME","York","ME",23,31,6,"A","Cold"]
[null,"AlconaMI","Alcona","MI",26,1,6,"A","Cold"]
[null,"AlgerMI","Alger","MI",26,3,6,"A","Cold"]
[null,"AlleganMI","Allegan","MI",26,5,5,"A","Cold"]
[null,"AlpenaMI","Alpena","MI",26,7,6,"A","Cold"]
[null,"AntrimMI","Antrim","MI",26,9,6,"A","Cold"]
[null,"ArenacMI","Arenac","MI",26,11,6,"A","Cold"]
[null,"BaragaMI","Baraga","MI",26,13,7,"N/A","Very Cold"]
[null,"BarryMI","Barry","MI",26,15,5,"A","Cold"]
[null,"BayMI","Bay","MI",26,17,5,"A","Cold"]
[null,"BenzieMI","Benzie","MI",26,19,6,"A","Cold"]
[null,"BerrienMI","Berrien","MI",26,21,5,"A","Cold"]
[null,"BranchMI","Branch","MI",26,23,5,"A","Cold"]
[null,"CalhounMI","Calhoun","MI",26,25,5,"A","Cold"]
[null,"CassMI","Cass","MI",26,27,5,"A","Cold"]
[null,"CharlevoixMI","Charlevoix","MI",26,29,6,"A","Cold"]
[null,"CheboyganMI","Cheboygan","MI",26,31,6,"A","Cold"]
[null,"ChippewaMI","Chippewa","MI",26,33,7,"N/A","Very Cold"]
[null,"ClareMI","Clare","MI",26,35,6,"A","Cold"]
[null,"ClintonMI","Clinton","MI",26,37,5,"A","Cold"]
[null,"CrawfordMI","Crawford","MI",26,39,6,"A","Cold"]
[null,"DeltaMI","Delta","MI",26,41,6,"A","Cold"]
[null,"DickinsonMI","Dickinson","MI",26,43,6,"A","Cold"]
[null,"EatonMI","Eaton","MI",26,45,5,"A","Cold"]
[null,"EmmetMI","Emmet","MI",26,47,6,"A","Cold"]
[null,"GeneseeMI","Genesee","MI",26,49,5,"A","Cold"]
[null,"GladwinMI","Gladwin","MI",26,51,6,"A","Cold"]
[null,"GogebicMI","Gogebic","MI",26,53,7,"N/A","Very Cold"]
[null,"Grand TraverseMI","Grand Traverse","MI",26,55,6,"A","Cold"]
[null,"GratiotMI","Gratiot","MI",26,57,5,"A","Cold"]
[null,"HillsdaleMI","Hillsdale","MI",26,59,5,"A","Cold"]
[null,"HoughtonMI","Houghton","MI",26,61,7,"N/A","Very Cold"]
[null,"HuronMI","Huron","MI",26,63,6,"A","Cold"]
[null,"InghamMI","Ingham","MI",26,65,5,"A","Cold"]
[null,"IoniaMI","Ionia","MI",26,67,5,"A","Cold"]
[null,"IoscoMI","Iosco","MI",26,69,6,"A","Cold"]
[null,"IronMI","Iron","MI",26,71,7,"N/A","Very Cold"]
[null,"IsabellaMI","Isabella","MI",26,73,6,"A","Cold"]
[null,"JacksonMI","Jackson","MI",26,75,5,"A","Cold"]
[null,"KalamazooMI","Kalamazoo","MI",26,77,5,"A","Cold"]
[null,"KalkaskaMI","Kalkaska","MI",26,79,6,"A","Cold"]
[null,"KentMI","Kent","MI",26,81,5,"A","Cold"]
[null,"KeweenawMI","Keweenaw","MI",26,83,7,"N/A","Very Cold"]
[null,"LakeMI","Lake","MI",26,85,6,"A","Cold"]
[null,"LapeerMI","Lapeer","MI",26,87,5,"A","Cold"]
[null,{"$f":"CONCATENATE(C1284,D1284)","v":"LeelanauMI"},"Leelanau","MI",26,89,6,"A","Cold"]
[null,"LenaweeMI","Lenawee","MI",26,91,5,"A","Cold"]
[null,"LivingstonMI","Livingston","MI",26,93,5,"A","Cold"]
[null,"LuceMI","Luce","MI",26,95,7,"N/A","Very Cold"]
[null,"MackinacMI","Mackinac","MI",26,97,7,"N/A","Very Cold"]
[null,"MacombMI","Macomb","MI",26,99,5,"A","Cold"]
[null,"ManisteeMI","Manistee","MI",26,101,6,"A","Cold"]
[null,"MarquetteMI","Marquette","MI",26,103,6,"A","Cold"]
[null,"MasonMI","Mason","MI",26,105,6,"A","Cold"]
[null,"MecostaMI","Mecosta","MI",26,107,6,"A","Cold"]
[null,"MenomineeMI","Menominee","MI",26,109,6,"A","Cold"]
[null,"MidlandMI","Midland","MI",26,111,5,"A","Cold"]
[null,"MissaukeeMI","Missaukee","MI",26,113,6,"A","Cold"]
[null,"MonroeMI","Monroe","MI",26,115,5,"A","Cold"]
[null,"MontcalmMI","Montcalm","MI",26,117,5,"A","Cold"]
[null,"MontmorencyMI","Montmorency","MI",26,119,6,"A","Cold"]
[null,"MuskegonMI","Muskegon","MI",26,121,5,"A","Cold"]
[null,"NewaygoMI","Newaygo","MI",26,123,6,"A","Cold"]
[null,"OaklandMI","Oakland","MI",26,125,5,"A","Cold"]
[null,"OceanaMI","Oceana","MI",26,127,6,"A","Cold"]
[null,"OgemawMI","Ogemaw","MI",26,129,6,"A","Cold"]
[null,"OntonagonMI","Ontonagon","MI",26,131,7,"N/A","Very Cold"]
[null,"OsceolaMI","Osceola","MI",26,133,6,"A","Cold"]
[null,"OscodaMI","Oscoda","MI",26,135,6,"A","Cold"]
[null,"OtsegoMI","Otsego","MI",26,137,6,"A","Cold"]
[null,"OttawaMI","Ottawa","MI",26,139,5,"A","Cold"]
[null,"Presque IsleMI","Presque Isle","MI",26,141,6,"A","Cold"]
[null,"RoscommonMI","Roscommon","MI",26,143,6,"A","Cold"]
[null,"SaginawMI","Saginaw","MI",26,145,5,"A","Cold"]
[null,"SanilacMI","Sanilac","MI",26,151,6,"A","Cold"]
[null,"SchoolcraftMI","Schoolcraft","MI",26,153,7,"N/A","Very Cold"]
[null,"ShiawasseeMI","Shiawassee","MI",26,155,5,"A","Cold"]
[null,"St. ClairMI","St. Clair","MI",26,147,5,"A","Cold"]
[null,"St. JosephMI","St. Joseph","MI",26,149,5,"A","Cold"]
[null,"TuscolaMI","Tuscola","MI",26,157,5,"A","Cold"]
[null,"Van BurenMI","Van Buren","MI",26,159,5,"A","Cold"]
[null,"WashtenawMI","Washtenaw","MI",26,161,5,"A","Cold"]
[null,"WayneMI","Wayne","MI",26,163,5,"A","Cold"]
[null,"WexfordMI","Wexford","MI",26,165,6,"A","Cold"]
[null,"AitkinMN","Aitkin","MN",27,1,7,"N/A","Very Cold"]
[null,"AnokaMN","Anoka","MN",27,3,6,"A","Cold"]
[null,"BeckerMN","Becker","MN",27,5,7,"N/A","Very Cold"]
[null,"BeltramiMN","Beltrami","MN",27,7,7,"N/A","Very Cold"]
[null,"BentonMN","Benton","MN",27,9,6,"A","Cold"]
[null,"Big StoneMN","Big Stone","MN",27,11,6,"A","Cold"]
[null,"Blue EarthMN","Blue Earth","MN",27,13,6,"A","Cold"]
[null,"BrownMN","Brown","MN",27,15,6,"A","Cold"]
[null,"CarltonMN","Carlton","MN",27,17,7,"N/A","Very Cold"]
[null,"CarverMN","Carver","MN",27,19,6,"A","Cold"]
[null,"CassMN","Cass","MN",27,21,7,"N/A","Very Cold"]
[null,"ChippewaMN","Chippewa","MN",27,23,6,"A","Cold"]
[null,"ChisagoMN","Chisago","MN",27,25,6,"A","Cold"]
[null,"ClayMN","Clay","MN",27,27,7,"N/A","Very Cold"]
[null,"ClearwaterMN","Clearwater","MN",27,29,7,"N/A","Very Cold"]
[null,"CookMN","Cook","MN",27,31,7,"N/A","Very Cold"]
[null,"CottonwoodMN","Cottonwood","MN",27,33,6,"A","Cold"]
[null,"Crow WingMN","Crow Wing","MN",27,35,7,"N/A","Very Cold"]
[null,"DakotaMN","Dakota","MN",27,37,6,"A","Cold"]
[null,"DodgeMN","Dodge","MN",27,39,6,"A","Cold"]
[null,"DouglasMN","Douglas","MN",27,41,6,"A","Cold"]
[null,"FaribaultMN","Faribault","MN",27,43,6,"A","Cold"]
[null,"FillmoreMN","Fillmore","MN",27,45,6,"A","Cold"]
[null,"FreebornMN","Freeborn","MN",27,47,6,"A","Cold"]
[null,"GoodhueMN","Goodhue","MN",27,49,6,"A","Cold"]
[null,{"$f":"CONCATENATE(C1348,D1348)","v":"GrantMN"},"Grant","MN",27,51,7,"N/A","Very Cold"]
[null,"HennepinMN","Hennepin","MN",27,53,6,"A","Cold"]
[null,"HoustonMN","Houston","MN",27,55,6,"A","Cold"]
[null,"HubbardMN","Hubbard","MN",27,57,7,"N/A","Very Cold"]
[null,"IsantiMN","Isanti","MN",27,59,6,"A","Cold"]
[null,"ItascaMN","Itasca","MN",27,61,7,"N/A","Very Cold"]
[null,"JacksonMN","Jackson","MN",27,63,6,"A","Cold"]
[null,"KanabecMN","Kanabec","MN",27,65,7,"N/A","Very Cold"]
[null,"KandiyohiMN","Kandiyohi","MN",27,67,6,"A","Cold"]
[null,"KittsonMN","Kittson","MN",27,69,7,"N/A","Very Cold"]
[null,"KoochichingMN","Koochiching","MN",27,71,7,"N/A","Very Cold"]
[null,"Lac qui ParleMN","Lac qui Parle","MN",27,73,6,"A","Cold"]
[null,"LakeMN","Lake","MN",27,75,7,"N/A","Very Cold"]
[null,"Lake of the WoodsMN","Lake of the Woods","MN",27,77,7,"N/A","Very Cold"]
[null,"Le SueurMN","Le Sueur","MN",27,79,6,"A","Cold"]
[null,"LincolnMN","Lincoln","MN",27,81,6,"A","Cold"]
[null,"LyonMN","Lyon","MN",27,83,6,"A","Cold"]
[null,"MahnomenMN","Mahnomen","MN",27,87,7,"N/A","Very Cold"]
[null,"MarshallMN","Marshall","MN",27,89,7,"N/A","Very Cold"]
[null,"MartinMN","Martin","MN",27,91,6,"A","Cold"]
[null,"McLeodMN","McLeod","MN",27,85,6,"A","Cold"]
[null,"MeekerMN","Meeker","MN",27,93,6,"A","Cold"]
[null,"Mille LacsMN","Mille Lacs","MN",27,95,7,"N/A","Very Cold"]
[null,"MorrisonMN","Morrison","MN",27,97,6,"A","Cold"]
[null,"MowerMN","Mower","MN",27,99,6,"A","Cold"]
[null,"MurrayMN","Murray","MN",27,101,6,"A","Cold"]
[null,"NicolletMN","Nicollet","MN",27,103,6,"A","Cold"]
[null,"NoblesMN","Nobles","MN",27,105,6,"A","Cold"]
[null,"NormanMN","Norman","MN",27,107,7,"N/A","Very Cold"]
[null,"OlmstedMN","Olmsted","MN",27,109,6,"A","Cold"]
[null,"Otter TailMN","Otter Tail","MN",27,111,7,"N/A","Very Cold"]
[null,"PenningtonMN","Pennington","MN",27,113,7,"N/A","Very Cold"]
[null,"PineMN","Pine","MN",27,115,7,"N/A","Very Cold"]
[null,"PipestoneMN","Pipestone","MN",27,117,6,"A","Cold"]
[null,"PolkMN","Polk","MN",27,119,7,"N/A","Very Cold"]
[null,"PopeMN","Pope","MN",27,121,6,"A","Cold"]
[null,"RamseyMN","Ramsey","MN",27,123,6,"A","Cold"]
[null,"Red LakeMN","Red Lake","MN",27,125,7,"N/A","Very Cold"]
[null,"RedwoodMN","Redwood","MN",27,127,6,"A","Cold"]
[null,"RenvilleMN","Renville","MN",27,129,6,"A","Cold"]
[null,"RiceMN","Rice","MN",27,131,6,"A","Cold"]
[null,"RockMN","Rock","MN",27,133,6,"A","Cold"]
[null,"RoseauMN","Roseau","MN",27,135,7,"N/A","Very Cold"]
[null,"ScottMN","Scott","MN",27,139,6,"A","Cold"]
[null,"SherburneMN","Sherburne","MN",27,141,6,"A","Cold"]
[null,"SibleyMN","Sibley","MN",27,143,6,"A","Cold"]
[null,"St. LouisMN","St. Louis","MN",27,137,7,"N/A","Very Cold"]
[null,"StearnsMN","Stearns","MN",27,145,6,"A","Cold"]
[null,"SteeleMN","Steele","MN",27,147,6,"A","Cold"]
[null,"StevensMN","Stevens","MN",27,149,6,"A","Cold"]
[null,"SwiftMN","Swift","MN",27,151,6,"A","Cold"]
[null,"ToddMN","Todd","MN",27,153,6,"A","Cold"]
[null,"TraverseMN","Traverse","MN",27,155,6,"A","Cold"]
[null,"WabashaMN","Wabasha","MN",27,157,6,"A","Cold"]
[null,"WadenaMN","Wadena","MN",27,159,7,"N/A","Very Cold"]
[null,"WasecaMN","Waseca","MN",27,161,6,"A","Cold"]
[null,"WashingtonMN","Washington","MN",27,163,6,"A","Cold"]
[null,"WatonwanMN","Watonwan","MN",27,165,6,"A","Cold"]
[null,"WilkinMN","Wilkin","MN",27,167,7,"N/A","Very Cold"]
[null,"WinonaMN","Winona","MN",27,169,6,"A","Cold"]
[null,"WrightMN","Wright","MN",27,171,6,"A","Cold"]
[null,"Yellow MedicineMN","Yellow Medicine","MN",27,173,6,"A","Cold"]
[null,"AdairMO","Adair","MO",29,1,5,"A","Cold"]
[null,"AndrewMO","Andrew","MO",29,3,5,"A","Cold"]
[null,{"$f":"CONCATENATE(C1412,D1412)","v":"AtchisonMO"},"Atchison","MO",29,5,5,"A","Cold"]
[null,"AudrainMO","Audrain","MO",29,7,4,"A","Mixed-Humid"]
[null,"BarryMO","Barry","MO",29,9,4,"A","Mixed-Humid"]
[null,"BartonMO","Barton","MO",29,11,4,"A","Mixed-Humid"]
[null,"BatesMO","Bates","MO",29,13,4,"A","Mixed-Humid"]
[null,"BentonMO","Benton","MO",29,15,4,"A","Mixed-Humid"]
[null,"BollingerMO","Bollinger","MO",29,17,4,"A","Mixed-Humid"]
[null,"BooneMO","Boone","MO",29,19,4,"A","Mixed-Humid"]
[null,"BuchananMO","Buchanan","MO",29,21,5,"A","Cold"]
[null,"ButlerMO","Butler","MO",29,23,4,"A","Mixed-Humid"]
[null,"CaldwellMO","Caldwell","MO",29,25,5,"A","Cold"]
[null,"CallawayMO","Callaway","MO",29,27,4,"A","Mixed-Humid"]
[null,"CamdenMO","Camden","MO",29,29,4,"A","Mixed-Humid"]
[null,"Cape GirardeauMO","Cape Girardeau","MO",29,31,4,"A","Mixed-Humid"]
[null,"CarrollMO","Carroll","MO",29,33,4,"A","Mixed-Humid"]
[null,"CarterMO","Carter","MO",29,35,4,"A","Mixed-Humid"]
[null,"CassMO","Cass","MO",29,37,4,"A","Mixed-Humid"]
[null,"CedarMO","Cedar","MO",29,39,4,"A","Mixed-Humid"]
[null,"CharitonMO","Chariton","MO",29,41,5,"A","Cold"]
[null,"ChristianMO","Christian","MO",29,43,4,"A","Mixed-Humid"]
[null,"ClarkMO","Clark","MO",29,45,5,"A","Cold"]
[null,"ClayMO","Clay","MO",29,47,4,"A","Mixed-Humid"]
[null,"ClintonMO","Clinton","MO",29,49,5,"A","Cold"]
[null,"ColeMO","Cole","MO",29,51,4,"A","Mixed-Humid"]
[null,"CooperMO","Cooper","MO",29,53,4,"A","Mixed-Humid"]
[null,"CrawfordMO","Crawford","MO",29,55,4,"A","Mixed-Humid"]
[null,"DadeMO","Dade","MO",29,57,4,"A","Mixed-Humid"]
[null,"DallasMO","Dallas","MO",29,59,4,"A","Mixed-Humid"]
[null,"DaviessMO","Daviess","MO",29,61,5,"A","Cold"]
[null,"DeKalbMO","DeKalb","MO",29,63,5,"A","Cold"]
[null,"DentMO","Dent","MO",29,65,4,"A","Mixed-Humid"]
[null,"DouglasMO","Douglas","MO",29,67,4,"A","Mixed-Humid"]
[null,"DunklinMO","Dunklin","MO",29,69,4,"A","Mixed-Humid"]
[null,"FranklinMO","Franklin","MO",29,71,4,"A","Mixed-Humid"]
[null,"GasconadeMO","Gasconade","MO",29,73,4,"A","Mixed-Humid"]
[null,"GentryMO","Gentry","MO",29,75,5,"A","Cold"]
[null,"GreeneMO","Greene","MO",29,77,4,"A","Mixed-Humid"]
[null,"GrundyMO","Grundy","MO",29,79,5,"A","Cold"]
[null,"HarrisonMO","Harrison","MO",29,81,5,"A","Cold"]
[null,"HenryMO","Henry","MO",29,83,4,"A","Mixed-Humid"]
[null,"HickoryMO","Hickory","MO",29,85,4,"A","Mixed-Humid"]
[null,"HoltMO","Holt","MO",29,87,5,"A","Cold"]
[null,"HowardMO","Howard","MO",29,89,4,"A","Mixed-Humid"]
[null,"HowellMO","Howell","MO",29,91,4,"A","Mixed-Humid"]
[null,"IronMO","Iron","MO",29,93,4,"A","Mixed-Humid"]
[null,"JacksonMO","Jackson","MO",29,95,4,"A","Mixed-Humid"]
[null,"JasperMO","Jasper","MO",29,97,4,"A","Mixed-Humid"]
[null,"JeffersonMO","Jefferson","MO",29,99,4,"A","Mixed-Humid"]
[null,"JohnsonMO","Johnson","MO",29,101,4,"A","Mixed-Humid"]
[null,"KnoxMO","Knox","MO",29,103,5,"A","Cold"]
[null,"LacledeMO","Laclede","MO",29,105,4,"A","Mixed-Humid"]
[null,"LafayetteMO","Lafayette","MO",29,107,4,"A","Mixed-Humid"]
[null,"LawrenceMO","Lawrence","MO",29,109,4,"A","Mixed-Humid"]
[null,"LewisMO","Lewis","MO",29,111,5,"A","Cold"]
[null,"LincolnMO","Lincoln","MO",29,113,4,"A","Mixed-Humid"]
[null,"LinnMO","Linn","MO",29,115,5,"A","Cold"]
[null,"LivingstonMO","Livingston","MO",29,117,5,"A","Cold"]
[null,"MaconMO","Macon","MO",29,121,5,"A","Cold"]
[null,"MadisonMO","Madison","MO",29,123,4,"A","Mixed-Humid"]
[null,"MariesMO","Maries","MO",29,125,4,"A","Mixed-Humid"]
[null,"MarionMO","Marion","MO",29,127,5,"A","Cold"]
[null,"McDonaldMO","McDonald","MO",29,119,4,"A","Mixed-Humid"]
[null,"MercerMO","Mercer","MO",29,129,5,"A","Cold"]
[null,"MillerMO","Miller","MO",29,131,4,"A","Mixed-Humid"]
[null,{"$f":"CONCATENATE(C1476,D1476)","v":"MississippiMO"},"Mississippi","MO",29,133,4,"A","Mixed-Humid"]
[null,"MoniteauMO","Moniteau","MO",29,135,4,"A","Mixed-Humid"]
[null,"MonroeMO","Monroe","MO",29,137,4,"A","Mixed-Humid"]
[null,"MontgomeryMO","Montgomery","MO",29,139,4,"A","Mixed-Humid"]
[null,"MorganMO","Morgan","MO",29,141,4,"A","Mixed-Humid"]
[null,"New MadridMO","New Madrid","MO",29,143,4,"A","Mixed-Humid"]
[null,"NewtonMO","Newton","MO",29,145,4,"A","Mixed-Humid"]
[null,"NodawayMO","Nodaway","MO",29,147,5,"A","Cold"]
[null,"OregonMO","Oregon","MO",29,149,4,"A","Mixed-Humid"]
[null,"OsageMO","Osage","MO",29,151,4,"A","Mixed-Humid"]
[null,"OzarkMO","Ozark","MO",29,153,4,"A","Mixed-Humid"]
[null,"PemiscotMO","Pemiscot","MO",29,155,4,"A","Mixed-Humid"]
[null,"PerryMO","Perry","MO",29,157,4,"A","Mixed-Humid"]
[null,"PettisMO","Pettis","MO",29,159,4,"A","Mixed-Humid"]
[null,"PhelpsMO","Phelps","MO",29,161,4,"A","Mixed-Humid"]
[null,"PikeMO","Pike","MO",29,163,5,"A","Cold"]
[null,"PlatteMO","Platte","MO",29,165,4,"A","Mixed-Humid"]
[null,"PolkMO","Polk","MO",29,167,4,"A","Mixed-Humid"]
[null,"PulaskiMO","Pulaski","MO",29,169,4,"A","Mixed-Humid"]
[null,"PutnamMO","Putnam","MO",29,171,5,"A","Cold"]
[null,"RallsMO","Ralls","MO",29,173,5,"A","Cold"]
[null,"RandolphMO","Randolph","MO",29,175,4,"A","Mixed-Humid"]
[null,"RayMO","Ray","MO",29,177,4,"A","Mixed-Humid"]
[null,"ReynoldsMO","Reynolds","MO",29,179,4,"A","Mixed-Humid"]
[null,"RipleyMO","Ripley","MO",29,181,4,"A","Mixed-Humid"]
[null,"SalineMO","Saline","MO",29,195,4,"A","Mixed-Humid"]
[null,"SchuylerMO","Schuyler","MO",29,197,5,"A","Cold"]
[null,"ScotlandMO","Scotland","MO",29,199,5,"A","Cold"]
[null,"ScottMO","Scott","MO",29,201,4,"A","Mixed-Humid"]
[null,"ShannonMO","Shannon","MO",29,203,4,"A","Mixed-Humid"]
[null,"ShelbyMO","Shelby","MO",29,205,5,"A","Cold"]
[null,"St. CharlesMO","St. Charles","MO",29,183,4,"A","Mixed-Humid"]
[null,"St. ClairMO","St. Clair","MO",29,185,4,"A","Mixed-Humid"]
[null,"St. FrancoisMO","St. Francois","MO",29,187,4,"A","Mixed-Humid"]
[null,"St. LouisMO","St. Louis","MO",29,189,4,"A","Mixed-Humid"]
[null,"St. Louis (city)MO","St. Louis (city)","MO",29,510,4,"A","Mixed-Humid"]
[null,"Ste. GenevieveMO","Ste. Genevieve","MO",29,186,4,"A","Mixed-Humid"]
[null,"StoddardMO","Stoddard","MO",29,207,4,"A","Mixed-Humid"]
[null,"StoneMO","Stone","MO",29,209,4,"A","Mixed-Humid"]
[null,"SullivanMO","Sullivan","MO",29,211,5,"A","Cold"]
[null,"TaneyMO","Taney","MO",29,213,4,"A","Mixed-Humid"]
[null,"TexasMO","Texas","MO",29,215,4,"A","Mixed-Humid"]
[null,"VernonMO","Vernon","MO",29,217,4,"A","Mixed-Humid"]
[null,"WarrenMO","Warren","MO",29,219,4,"A","Mixed-Humid"]
[null,"WashingtonMO","Washington","MO",29,221,4,"A","Mixed-Humid"]
[null,"WayneMO","Wayne","MO",29,223,4,"A","Mixed-Humid"]
[null,"WebsterMO","Webster","MO",29,225,4,"A","Mixed-Humid"]
[null,"WorthMO","Worth","MO",29,227,5,"A","Cold"]
[null,"WrightMO","Wright","MO",29,229,4,"A","Mixed-Humid"]
[null,"Northern IslandsMP","Northern Islands","MP",69,85,1,"A","Hot-Humid"]
[null,"RotaMP","Rota","MP",69,100,1,"A","Hot-Humid"]
[null,"SaipanMP","Saipan","MP",69,110,1,"A","Hot-Humid"]
[null,"TinianMP","Tinian","MP",69,120,1,"A","Hot-Humid"]
[null,"AdamsMS","Adams","MS",28,1,3,"A","Hot-Humid"]
[null,"AlcornMS","Alcorn","MS",28,3,3,"A","Mixed-Humid"]
[null,"AmiteMS","Amite","MS",28,5,3,"A","Hot-Humid"]
[null,"AttalaMS","Attala","MS",28,7,3,"A","Mixed-Humid"]
[null,"BentonMS","Benton","MS",28,9,3,"A","Mixed-Humid"]
[null,"BolivarMS","Bolivar","MS",28,11,3,"A","Mixed-Humid"]
[null,"CalhounMS","Calhoun","MS",28,13,3,"A","Mixed-Humid"]
[null,"CarrollMS","Carroll","MS",28,15,3,"A","Mixed-Humid"]
[null,"ChickasawMS","Chickasaw","MS",28,17,3,"A","Mixed-Humid"]
[null,"ChoctawMS","Choctaw","MS",28,19,3,"A","Mixed-Humid"]
[null,"ClaiborneMS","Claiborne","MS",28,21,3,"A","Hot-Humid"]
[null,{"$f":"CONCATENATE(C1540,D1540)","v":"ClarkeMS"},"Clarke","MS",28,23,3,"A","Mixed-Humid"]
[null,"ClayMS","Clay","MS",28,25,3,"A","Mixed-Humid"]
[null,"CoahomaMS","Coahoma","MS",28,27,3,"A","Mixed-Humid"]
[null,"CopiahMS","Copiah","MS",28,29,3,"A","Hot-Humid"]
[null,"CovingtonMS","Covington","MS",28,31,3,"A","Hot-Humid"]
[null,"DeSotoMS","DeSoto","MS",28,33,3,"A","Mixed-Humid"]
[null,"ForrestMS","Forrest","MS",28,35,3,"A","Hot-Humid"]
[null,"FranklinMS","Franklin","MS",28,37,3,"A","Hot-Humid"]
[null,"GeorgeMS","George","MS",28,39,3,"A","Hot-Humid"]
[null,"GreeneMS","Greene","MS",28,41,3,"A","Hot-Humid"]
[null,"GrenadaMS","Grenada","MS",28,43,3,"A","Mixed-Humid"]
[null,"HancockMS","Hancock","MS",28,45,2,"A","Hot-Humid"]
[null,"HarrisonMS","Harrison","MS",28,47,2,"A","Hot-Humid"]
[null,"HindsMS","Hinds","MS",28,49,3,"A","Hot-Humid"]
[null,"HolmesMS","Holmes","MS",28,51,3,"A","Mixed-Humid"]
[null,"HumphreysMS","Humphreys","MS",28,53,3,"A","Mixed-Humid"]
[null,"IssaquenaMS","Issaquena","MS",28,55,3,"A","Mixed-Humid"]
[null,"ItawambaMS","Itawamba","MS",28,57,3,"A","Mixed-Humid"]
[null,"JacksonMS","Jackson","MS",28,59,2,"A","Hot-Humid"]
[null,"JasperMS","Jasper","MS",28,61,3,"A","Mixed-Humid"]
[null,"JeffersonMS","Jefferson","MS",28,63,3,"A","Hot-Humid"]
[null,"Jefferson DavisMS","Jefferson Davis","MS",28,65,3,"A","Hot-Humid"]
[null,"JonesMS","Jones","MS",28,67,3,"A","Hot-Humid"]
[null,"KemperMS","Kemper","MS",28,69,3,"A","Mixed-Humid"]
[null,"LafayetteMS","Lafayette","MS",28,71,3,"A","Mixed-Humid"]
[null,"LamarMS","Lamar","MS",28,73,3,"A","Hot-Humid"]
[null,"LauderdaleMS","Lauderdale","MS",28,75,3,"A","Mixed-Humid"]
[null,"LawrenceMS","Lawrence","MS",28,77,3,"A","Hot-Humid"]
[null,"LeakeMS","Leake","MS",28,79,3,"A","Mixed-Humid"]
[null,"LeeMS","Lee","MS",28,81,3,"A","Mixed-Humid"]
[null,"LefloreMS","Leflore","MS",28,83,3,"A","Mixed-Humid"]
[null,"LincolnMS","Lincoln","MS",28,85,3,"A","Hot-Humid"]
[null,"LowndesMS","Lowndes","MS",28,87,3,"A","Mixed-Humid"]
[null,"MadisonMS","Madison","MS",28,89,3,"A","Mixed-Humid"]
[null,"MarionMS","Marion","MS",28,91,3,"A","Hot-Humid"]
[null,"MarshallMS","Marshall","MS",28,93,3,"A","Mixed-Humid"]
[null,"MonroeMS","Monroe","MS",28,95,3,"A","Mixed-Humid"]
[null,"MontgomeryMS","Montgomery","MS",28,97,3,"A","Mixed-Humid"]
[null,"NeshobaMS","Neshoba","MS",28,99,3,"A","Mixed-Humid"]
[null,"NewtonMS","Newton","MS",28,101,3,"A","Mixed-Humid"]
[null,"NoxubeeMS","Noxubee","MS",28,103,3,"A","Mixed-Humid"]
[null,"OktibbehaMS","Oktibbeha","MS",28,105,3,"A","Mixed-Humid"]
[null,"PanolaMS","Panola","MS",28,107,3,"A","Mixed-Humid"]
[null,"Pearl RiverMS","Pearl River","MS",28,109,2,"A","Hot-Humid"]
[null,"PerryMS","Perry","MS",28,111,3,"A","Hot-Humid"]
[null,"PikeMS","Pike","MS",28,113,3,"A","Hot-Humid"]
[null,"PontotocMS","Pontotoc","MS",28,115,3,"A","Mixed-Humid"]
[null,"PrentissMS","Prentiss","MS",28,117,3,"A","Mixed-Humid"]
[null,"QuitmanMS","Quitman","MS",28,119,3,"A","Mixed-Humid"]
[null,"RankinMS","Rankin","MS",28,121,3,"A","Hot-Humid"]
[null,"ScottMS","Scott","MS",28,123,3,"A","Mixed-Humid"]
[null,"SharkeyMS","Sharkey","MS",28,125,3,"A","Mixed-Humid"]
[null,"SimpsonMS","Simpson","MS",28,127,3,"A","Hot-Humid"]
[null,"SmithMS","Smith","MS",28,129,3,"A","Hot-Humid"]
[null,"StoneMS","Stone","MS",28,131,2,"A","Hot-Humid"]
[null,"SunflowerMS","Sunflower","MS",28,133,3,"A","Mixed-Humid"]
[null,"TallahatchieMS","Tallahatchie","MS",28,135,3,"A","Mixed-Humid"]
[null,"TateMS","Tate","MS",28,137,3,"A","Mixed-Humid"]
[null,"TippahMS","Tippah","MS",28,139,3,"A","Mixed-Humid"]
[null,"TishomingoMS","Tishomingo","MS",28,141,3,"A","Mixed-Humid"]
[null,"TunicaMS","Tunica","MS",28,143,3,"A","Mixed-Humid"]
[null,"UnionMS","Union","MS",28,145,3,"A","Mixed-Humid"]
[null,"WalthallMS","Walthall","MS",28,147,3,"A","Hot-Humid"]
[null,"WarrenMS","Warren","MS",28,149,3,"A","Hot-Humid"]
[null,{"$f":"CONCATENATE(C1604,D1604)","v":"WashingtonMS"},"Washington","MS",28,151,3,"A","Mixed-Humid"]
[null,"WayneMS","Wayne","MS",28,153,3,"A","Hot-Humid"]
[null,"WebsterMS","Webster","MS",28,155,3,"A","Mixed-Humid"]
[null,"WilkinsonMS","Wilkinson","MS",28,157,3,"A","Hot-Humid"]
[null,"WinstonMS","Winston","MS",28,159,3,"A","Mixed-Humid"]
[null,"YalobushaMS","Yalobusha","MS",28,161,3,"A","Mixed-Humid"]
[null,"YazooMS","Yazoo","MS",28,163,3,"A","Mixed-Humid"]
[null,"BeaverheadMT","Beaverhead","MT",30,1,6,"B","Cold"]
[null,"Big HornMT","Big Horn","MT",30,3,6,"B","Cold"]
[null,"BlaineMT","Blaine","MT",30,5,6,"B","Cold"]
[null,"BroadwaterMT","Broadwater","MT",30,7,6,"B","Cold"]
[null,"CarbonMT","Carbon","MT",30,9,6,"B","Cold"]
[null,"CarterMT","Carter","MT",30,11,6,"B","Cold"]
[null,"CascadeMT","Cascade","MT",30,13,6,"B","Cold"]
[null,"ChouteauMT","Chouteau","MT",30,15,6,"B","Cold"]
[null,"CusterMT","Custer","MT",30,17,6,"B","Cold"]
[null,"DanielsMT","Daniels","MT",30,19,6,"B","Cold"]
[null,"DawsonMT","Dawson","MT",30,21,6,"B","Cold"]
[null,"Deer LodgeMT","Deer Lodge","MT",30,23,6,"B","Cold"]
[null,"FallonMT","Fallon","MT",30,25,6,"B","Cold"]
[null,"FergusMT","Fergus","MT",30,27,6,"B","Cold"]
[null,"FlatheadMT","Flathead","MT",30,29,6,"B","Cold"]
[null,"GallatinMT","Gallatin","MT",30,31,6,"B","Cold"]
[null,"GarfieldMT","Garfield","MT",30,33,6,"B","Cold"]
[null,"GlacierMT","Glacier","MT",30,35,6,"B","Cold"]
[null,"Golden ValleyMT","Golden Valley","MT",30,37,6,"B","Cold"]
[null,"GraniteMT","Granite","MT",30,39,6,"B","Cold"]
[null,"HillMT","Hill","MT",30,41,6,"B","Cold"]
[null,"JeffersonMT","Jefferson","MT",30,43,6,"B","Cold"]
[null,"Judith BasinMT","Judith Basin","MT",30,45,6,"B","Cold"]
[null,"LakeMT","Lake","MT",30,47,6,"B","Cold"]
[null,"Lewis and ClarkMT","Lewis and Clark","MT",30,49,6,"B","Cold"]
[null,"LibertyMT","Liberty","MT",30,51,6,"B","Cold"]
[null,"LincolnMT","Lincoln","MT",30,53,6,"B","Cold"]
[null,"MadisonMT","Madison","MT",30,57,6,"B","Cold"]
[null,"McConeMT","McCone","MT",30,55,6,"B","Cold"]
[null,"MeagherMT","Meagher","MT",30,59,6,"B","Cold"]
[null,"MineralMT","Mineral","MT",30,61,6,"B","Cold"]
[null,"MissoulaMT","Missoula","MT",30,63,6,"B","Cold"]
[null,"MusselshellMT","Musselshell","MT",30,65,6,"B","Cold"]
[null,"ParkMT","Park","MT",30,67,6,"B","Cold"]
[null,"PetroleumMT","Petroleum","MT",30,69,6,"B","Cold"]
[null,"PhillipsMT","Phillips","MT",30,71,6,"B","Cold"]
[null,"PonderaMT","Pondera","MT",30,73,6,"B","Cold"]
[null,"Powder RiverMT","Powder River","MT",30,75,6,"B","Cold"]
[null,"PowellMT","Powell","MT",30,77,6,"B","Cold"]
[null,"PrairieMT","Prairie","MT",30,79,6,"B","Cold"]
[null,"RavalliMT","Ravalli","MT",30,81,6,"B","Cold"]
[null,"RichlandMT","Richland","MT",30,83,6,"B","Cold"]
[null,"RooseveltMT","Roosevelt","MT",30,85,6,"B","Cold"]
[null,"RosebudMT","Rosebud","MT",30,87,6,"B","Cold"]
[null,"SandersMT","Sanders","MT",30,89,6,"B","Cold"]
[null,"SheridanMT","Sheridan","MT",30,91,6,"B","Cold"]
[null,"Silver BowMT","Silver Bow","MT",30,93,6,"B","Cold"]
[null,"StillwaterMT","Stillwater","MT",30,95,6,"B","Cold"]
[null,"Sweet GrassMT","Sweet Grass","MT",30,97,6,"B","Cold"]
[null,"TetonMT","Teton","MT",30,99,6,"B","Cold"]
[null,"TooleMT","Toole","MT",30,101,6,"B","Cold"]
[null,"TreasureMT","Treasure","MT",30,103,6,"B","Cold"]
[null,"ValleyMT","Valley","MT",30,105,6,"B","Cold"]
[null,"WheatlandMT","Wheatland","MT",30,107,6,"B","Cold"]
[null,"WibauxMT","Wibaux","MT",30,109,6,"B","Cold"]
[null,"YellowstoneMT","Yellowstone","MT",30,111,6,"B","Cold"]
[null,"AlamanceNC","Alamance","NC",37,1,4,"A","Mixed-Humid"]
[null,{"$f":"CONCATENATE(C1668,D1668)","v":"AlexanderNC"},"Alexander","NC",37,3,4,"A","Mixed-Humid"]
[null,"AlleghanyNC","Alleghany","NC",37,5,5,"A","Cold"]
[null,"AnsonNC","Anson","NC",37,7,3,"A","Mixed-Humid"]
[null,"AsheNC","Ashe","NC",37,9,5,"A","Cold"]
[null,"AveryNC","Avery","NC",37,11,5,"A","Cold"]
[null,"BeaufortNC","Beaufort","NC",37,13,3,"A","Mixed-Humid"]
[null,"BertieNC","Bertie","NC",37,15,4,"A","Mixed-Humid"]
[null,"BladenNC","Bladen","NC",37,17,3,"A","Mixed-Humid"]
[null,"BrunswickNC","Brunswick","NC",37,19,3,"A","Hot-Humid"]
[null,"BuncombeNC","Buncombe","NC",37,21,4,"A","Mixed-Humid"]
[null,"BurkeNC","Burke","NC",37,23,4,"A","Mixed-Humid"]
[null,"CabarrusNC","Cabarrus","NC",37,25,3,"A","Mixed-Humid"]
[null,"CaldwellNC","Caldwell","NC",37,27,4,"A","Mixed-Humid"]
[null,"CamdenNC","Camden","NC",37,29,3,"A","Mixed-Humid"]
[null,"CarteretNC","Carteret","NC",37,31,3,"A","Hot-Humid"]
[null,"CaswellNC","Caswell","NC",37,33,4,"A","Mixed-Humid"]
[null,"CatawbaNC","Catawba","NC",37,35,4,"A","Mixed-Humid"]
[null,"ChathamNC","Chatham","NC",37,37,4,"A","Mixed-Humid"]
[null,"CherokeeNC","Cherokee","NC",37,39,4,"A","Mixed-Humid"]
[null,"ChowanNC","Chowan","NC",37,41,3,"A","Mixed-Humid"]
[null,"ClayNC","Clay","NC",37,43,4,"A","Mixed-Humid"]
[null,"ClevelandNC","Cleveland","NC",37,45,4,"A","Mixed-Humid"]
[null,"ColumbusNC","Columbus","NC",37,47,3,"A","Hot-Humid"]
[null,"CravenNC","Craven","NC",37,49,3,"A","Mixed-Humid"]
[null,"CumberlandNC","Cumberland","NC",37,51,3,"A","Mixed-Humid"]
[null,"CurrituckNC","Currituck","NC",37,53,3,"A","Mixed-Humid"]
[null,"DareNC","Dare","NC",37,55,3,"A","Mixed-Humid"]
[null,"DavidsonNC","Davidson","NC",37,57,3,"A","Mixed-Humid"]
[null,"DavieNC","Davie","NC",37,59,4,"A","Mixed-Humid"]
[null,"DuplinNC","Duplin","NC",37,61,3,"A","Mixed-Humid"]
[null,"DurhamNC","Durham","NC",37,63,4,"A","Mixed-Humid"]
[null,"EdgecombeNC","Edgecombe","NC",37,65,3,"A","Mixed-Humid"]
[null,"ForsythNC","Forsyth","NC",37,67,4,"A","Mixed-Humid"]
[null,"FranklinNC","Franklin","NC",37,69,4,"A","Mixed-Humid"]
[null,"GastonNC","Gaston","NC",37,71,3,"A","Mixed-Humid"]
[null,"GatesNC","Gates","NC",37,73,4,"A","Mixed-Humid"]
[null,"GrahamNC","Graham","NC",37,75,4,"A","Mixed-Humid"]
[null,"GranvilleNC","Granville","NC",37,77,4,"A","Mixed-Humid"]
[null,"GreeneNC","Greene","NC",37,79,3,"A","Mixed-Humid"]
[null,"GuilfordNC","Guilford","NC",37,81,4,"A","Mixed-Humid"]
[null,"HalifaxNC","Halifax","NC",37,83,4,"A","Mixed-Humid"]
[null,"HarnettNC","Harnett","NC",37,85,4,"A","Mixed-Humid"]
[null,"HaywoodNC","Haywood","NC",37,87,4,"A","Mixed-Humid"]
[null,"HendersonNC","Henderson","NC",37,89,4,"A","Mixed-Humid"]
[null,"HertfordNC","Hertford","NC",37,91,4,"A","Mixed-Humid"]
[null,"HokeNC","Hoke","NC",37,93,3,"A","Mixed-Humid"]
[null,"HydeNC","Hyde","NC",37,95,3,"A","Mixed-Humid"]
[null,"IredellNC","Iredell","NC",37,97,4,"A","Mixed-Humid"]
[null,"JacksonNC","Jackson","NC",37,99,4,"A","Mixed-Humid"]
[null,"JohnstonNC","Johnston","NC",37,101,3,"A","Mixed-Humid"]
[null,"JonesNC","Jones","NC",37,103,3,"A","Mixed-Humid"]
[null,"LeeNC","Lee","NC",37,105,4,"A","Mixed-Humid"]
[null,"LenoirNC","Lenoir","NC",37,107,3,"A","Mixed-Humid"]
[null,"LincolnNC","Lincoln","NC",37,109,4,"A","Mixed-Humid"]
[null,"MaconNC","Macon","NC",37,113,4,"A","Mixed-Humid"]
[null,"MadisonNC","Madison","NC",37,115,4,"A","Mixed-Humid"]
[null,"MartinNC","Martin","NC",37,117,3,"A","Mixed-Humid"]
[null,"McDowellNC","McDowell","NC",37,111,4,"A","Mixed-Humid"]
[null,"MecklenburgNC","Mecklenburg","NC",37,119,3,"A","Mixed-Humid"]
[null,"MitchellNC","Mitchell","NC",37,121,5,"A","Cold"]
[null,"MontgomeryNC","Montgomery","NC",37,123,3,"A","Mixed-Humid"]
[null,"MooreNC","Moore","NC",37,125,3,"A","Mixed-Humid"]
[null,"NashNC","Nash","NC",37,127,4,"A","Mixed-Humid"]
[null,"New HanoverNC","New Hanover","NC",37,129,3,"A","Hot-Humid"]
[null,{"$f":"CONCATENATE(C1732,D1732)","v":"NorthamptonNC"},"Northampton","NC",37,131,4,"A","Mixed-Humid"]
[null,"OnslowNC","Onslow","NC",37,133,3,"A","Hot-Humid"]
[null,"OrangeNC","Orange","NC",37,135,4,"A","Mixed-Humid"]
[null,"PamlicoNC","Pamlico","NC",37,137,3,"A","Mixed-Humid"]
[null,"PasquotankNC","Pasquotank","NC",37,139,3,"A","Mixed-Humid"]
[null,"PenderNC","Pender","NC",37,141,3,"A","Hot-Humid"]
[null,"PerquimansNC","Perquimans","NC",37,143,3,"A","Mixed-Humid"]
[null,"PersonNC","Person","NC",37,145,4,"A","Mixed-Humid"]
[null,"PittNC","Pitt","NC",37,147,3,"A","Mixed-Humid"]
[null,"PolkNC","Polk","NC",37,149,4,"A","Mixed-Humid"]
[null,"RandolphNC","Randolph","NC",37,151,3,"A","Mixed-Humid"]
[null,"RichmondNC","Richmond","NC",37,153,3,"A","Mixed-Humid"]
[null,"RobesonNC","Robeson","NC",37,155,3,"A","Mixed-Humid"]
[null,"RockinghamNC","Rockingham","NC",37,157,4,"A","Mixed-Humid"]
[null,"RowanNC","Rowan","NC",37,159,3,"A","Mixed-Humid"]
[null,"RutherfordNC","Rutherford","NC",37,161,4,"A","Mixed-Humid"]
[null,"SampsonNC","Sampson","NC",37,163,3,"A","Mixed-Humid"]
[null,"ScotlandNC","Scotland","NC",37,165,3,"A","Mixed-Humid"]
[null,"StanlyNC","Stanly","NC",37,167,3,"A","Mixed-Humid"]
[null,"StokesNC","Stokes","NC",37,169,4,"A","Mixed-Humid"]
[null,"SurryNC","Surry","NC",37,171,4,"A","Mixed-Humid"]
[null,"SwainNC","Swain","NC",37,173,4,"A","Mixed-Humid"]
[null,"TransylvaniaNC","Transylvania","NC",37,175,4,"A","Mixed-Humid"]
[null,"TyrrellNC","Tyrrell","NC",37,177,3,"A","Mixed-Humid"]
[null,"UnionNC","Union","NC",37,179,3,"A","Mixed-Humid"]
[null,"VanceNC","Vance","NC",37,181,4,"A","Mixed-Humid"]
[null,"WakeNC","Wake","NC",37,183,4,"A","Mixed-Humid"]
[null,"WarrenNC","Warren","NC",37,185,4,"A","Mixed-Humid"]
[null,"WashingtonNC","Washington","NC",37,187,3,"A","Mixed-Humid"]
[null,"WataugaNC","Watauga","NC",37,189,5,"A","Cold"]
[null,"WayneNC","Wayne","NC",37,191,3,"A","Mixed-Humid"]
[null,"WilkesNC","Wilkes","NC",37,193,4,"A","Mixed-Humid"]
[null,"WilsonNC","Wilson","NC",37,195,3,"A","Mixed-Humid"]
[null,"YadkinNC","Yadkin","NC",37,197,4,"A","Mixed-Humid"]
[null,"YanceyNC","Yancey","NC",37,199,5,"A","Cold"]
[null,"AdamsND","Adams","ND",38,1,6,"A","Cold"]
[null,"BarnesND","Barnes","ND",38,3,7,"N/A","Very Cold"]
[null,"BensonND","Benson","ND",38,5,7,"N/A","Very Cold"]
[null,"BillingsND","Billings","ND",38,7,6,"A","Cold"]
[null,"BottineauND","Bottineau","ND",38,9,7,"N/A","Very Cold"]
[null,"BowmanND","Bowman","ND",38,11,6,"A","Cold"]
[null,"BurkeND","Burke","ND",38,13,7,"N/A","Very Cold"]
[null,"BurleighND","Burleigh","ND",38,15,6,"A","Cold"]
[null,"CassND","Cass","ND",38,17,7,"N/A","Very Cold"]
[null,"CavalierND","Cavalier","ND",38,19,7,"N/A","Very Cold"]
[null,"DickeyND","Dickey","ND",38,21,6,"A","Cold"]
[null,"DivideND","Divide","ND",38,23,7,"N/A","Very Cold"]
[null,"DunnND","Dunn","ND",38,25,6,"A","Cold"]
[null,"EddyND","Eddy","ND",38,27,7,"N/A","Very Cold"]
[null,"EmmonsND","Emmons","ND",38,29,6,"A","Cold"]
[null,"FosterND","Foster","ND",38,31,7,"N/A","Very Cold"]
[null,"Golden ValleyND","Golden Valley","ND",38,33,6,"A","Cold"]
[null,"Grand ForksND","Grand Forks","ND",38,35,7,"N/A","Very Cold"]
[null,"GrantND","Grant","ND",38,37,6,"A","Cold"]
[null,"GriggsND","Griggs","ND",38,39,7,"N/A","Very Cold"]
[null,"HettingerND","Hettinger","ND",38,41,6,"A","Cold"]
[null,"KidderND","Kidder","ND",38,43,7,"N/A","Very Cold"]
[null,"LaMoureND","LaMoure","ND",38,45,6,"A","Cold"]
[null,"LoganND","Logan","ND",38,47,6,"A","Cold"]
[null,"McHenryND","McHenry","ND",38,49,7,"N/A","Very Cold"]
[null,"McIntoshND","McIntosh","ND",38,51,6,"A","Cold"]
[null,"McKenzieND","McKenzie","ND",38,53,6,"A","Cold"]
[null,"McLeanND","McLean","ND",38,55,7,"N/A","Very Cold"]
[null,"MercerND","Mercer","ND",38,57,6,"A","Cold"]
[null,{"$f":"CONCATENATE(C1796,D1796)","v":"MortonND"},"Morton","ND",38,59,6,"A","Cold"]
[null,"MountrailND","Mountrail","ND",38,61,7,"N/A","Very Cold"]
[null,"NelsonND","Nelson","ND",38,63,7,"N/A","Very Cold"]
[null,"OliverND","Oliver","ND",38,65,6,"A","Cold"]
[null,"PembinaND","Pembina","ND",38,67,7,"N/A","Very Cold"]
[null,"PierceND","Pierce","ND",38,69,7,"N/A","Very Cold"]
[null,"RamseyND","Ramsey","ND",38,71,7,"N/A","Very Cold"]
[null,"RansomND","Ransom","ND",38,73,6,"A","Cold"]
[null,"RenvilleND","Renville","ND",38,75,7,"N/A","Very Cold"]
[null,"RichlandND","Richland","ND",38,77,6,"A","Cold"]
[null,"RoletteND","Rolette","ND",38,79,7,"N/A","Very Cold"]
[null,"SargentND","Sargent","ND",38,81,6,"A","Cold"]
[null,"SheridanND","Sheridan","ND",38,83,7,"N/A","Very Cold"]
[null,"SiouxND","Sioux","ND",38,85,6,"A","Cold"]
[null,"SlopeND","Slope","ND",38,87,6,"A","Cold"]
[null,"StarkND","Stark","ND",38,89,6,"A","Cold"]
[null,"SteeleND","Steele","ND",38,91,7,"N/A","Very Cold"]
[null,"StutsmanND","Stutsman","ND",38,93,7,"N/A","Very Cold"]
[null,"TownerND","Towner","ND",38,95,7,"N/A","Very Cold"]
[null,"TraillND","Traill","ND",38,97,7,"N/A","Very Cold"]
[null,"WalshND","Walsh","ND",38,99,7,"N/A","Very Cold"]
[null,"WardND","Ward","ND",38,101,7,"N/A","Very Cold"]
[null,"WellsND","Wells","ND",38,103,7,"N/A","Very Cold"]
[null,"WilliamsND","Williams","ND",38,105,7,"N/A","Very Cold"]
[null,"AdamsNE","Adams","NE",31,1,5,"A","Cold"]
[null,"AntelopeNE","Antelope","NE",31,3,5,"A","Cold"]
[null,"ArthurNE","Arthur","NE",31,5,5,"A","Cold"]
[null,"BannerNE","Banner","NE",31,7,5,"A","Cold"]
[null,"BlaineNE","Blaine","NE",31,9,5,"A","Cold"]
[null,"BooneNE","Boone","NE",31,11,5,"A","Cold"]
[null,"Box ButteNE","Box Butte","NE",31,13,5,"A","Cold"]
[null,"BoydNE","Boyd","NE",31,15,5,"A","Cold"]
[null,"BrownNE","Brown","NE",31,17,5,"A","Cold"]
[null,"BuffaloNE","Buffalo","NE",31,19,5,"A","Cold"]
[null,"BurtNE","Burt","NE",31,21,5,"A","Cold"]
[null,"ButlerNE","Butler","NE",31,23,5,"A","Cold"]
[null,"CassNE","Cass","NE",31,25,5,"A","Cold"]
[null,"CedarNE","Cedar","NE",31,27,5,"A","Cold"]
[null,"ChaseNE","Chase","NE",31,29,5,"A","Cold"]
[null,"CherryNE","Cherry","NE",31,31,5,"A","Cold"]
[null,"CheyenneNE","Cheyenne","NE",31,33,5,"A","Cold"]
[null,"ClayNE","Clay","NE",31,35,5,"A","Cold"]
[null,"ColfaxNE","Colfax","NE",31,37,5,"A","Cold"]
[null,"CumingNE","Cuming","NE",31,39,5,"A","Cold"]
[null,"CusterNE","Custer","NE",31,41,5,"A","Cold"]
[null,"DakotaNE","Dakota","NE",31,43,5,"A","Cold"]
[null,"DawesNE","Dawes","NE",31,45,5,"A","Cold"]
[null,"DawsonNE","Dawson","NE",31,47,5,"A","Cold"]
[null,"DeuelNE","Deuel","NE",31,49,5,"A","Cold"]
[null,"DixonNE","Dixon","NE",31,51,5,"A","Cold"]
[null,"DodgeNE","Dodge","NE",31,53,5,"A","Cold"]
[null,"DouglasNE","Douglas","NE",31,55,5,"A","Cold"]
[null,"DundyNE","Dundy","NE",31,57,5,"A","Cold"]
[null,"FillmoreNE","Fillmore","NE",31,59,5,"A","Cold"]
[null,"FranklinNE","Franklin","NE",31,61,5,"A","Cold"]
[null,"FrontierNE","Frontier","NE",31,63,5,"A","Cold"]
[null,"FurnasNE","Furnas","NE",31,65,5,"A","Cold"]
[null,"GageNE","Gage","NE",31,67,5,"A","Cold"]
[null,"GardenNE","Garden","NE",31,69,5,"A","Cold"]
[null,"GarfieldNE","Garfield","NE",31,71,5,"A","Cold"]
[null,"GosperNE","Gosper","NE",31,73,5,"A","Cold"]
[null,"GrantNE","Grant","NE",31,75,5,"A","Cold"]
[null,"GreeleyNE","Greeley","NE",31,77,5,"A","Cold"]
[null,"HallNE","Hall","NE",31,79,5,"A","Cold"]
[null,{"$f":"CONCATENATE(C1860,D1860)","v":"HamiltonNE"},"Hamilton","NE",31,81,5,"A","Cold"]
[null,"HarlanNE","Harlan","NE",31,83,5,"A","Cold"]
[null,"HayesNE","Hayes","NE",31,85,5,"A","Cold"]
[null,"HitchcockNE","Hitchcock","NE",31,87,5,"A","Cold"]
[null,"HoltNE","Holt","NE",31,89,5,"A","Cold"]
[null,"HookerNE","Hooker","NE",31,91,5,"A","Cold"]
[null,"HowardNE","Howard","NE",31,93,5,"A","Cold"]
[null,"JeffersonNE","Jefferson","NE",31,95,5,"A","Cold"]
[null,"JohnsonNE","Johnson","NE",31,97,5,"A","Cold"]
[null,"KearneyNE","Kearney","NE",31,99,5,"A","Cold"]
[null,"KeithNE","Keith","NE",31,101,5,"A","Cold"]
[null,"Keya PahaNE","Keya Paha","NE",31,103,5,"A","Cold"]
[null,"KimballNE","Kimball","NE",31,105,5,"A","Cold"]
[null,"KnoxNE","Knox","NE",31,107,5,"A","Cold"]
[null,"LancasterNE","Lancaster","NE",31,109,5,"A","Cold"]
[null,"LincolnNE","Lincoln","NE",31,111,5,"A","Cold"]
[null,"LoganNE","Logan","NE",31,113,5,"A","Cold"]
[null,"LoupNE","Loup","NE",31,115,5,"A","Cold"]
[null,"MadisonNE","Madison","NE",31,119,5,"A","Cold"]
[null,"McPhersonNE","McPherson","NE",31,117,5,"A","Cold"]
[null,"MerrickNE","Merrick","NE",31,121,5,"A","Cold"]
[null,"MorrillNE","Morrill","NE",31,123,5,"A","Cold"]
[null,"NanceNE","Nance","NE",31,125,5,"A","Cold"]
[null,"NemahaNE","Nemaha","NE",31,127,5,"A","Cold"]
[null,"NuckollsNE","Nuckolls","NE",31,129,5,"A","Cold"]
[null,"OtoeNE","Otoe","NE",31,131,5,"A","Cold"]
[null,"PawneeNE","Pawnee","NE",31,133,5,"A","Cold"]
[null,"PerkinsNE","Perkins","NE",31,135,5,"A","Cold"]
[null,"PhelpsNE","Phelps","NE",31,137,5,"A","Cold"]
[null,"PierceNE","Pierce","NE",31,139,5,"A","Cold"]
[null,"PlatteNE","Platte","NE",31,141,5,"A","Cold"]
[null,"PolkNE","Polk","NE",31,143,5,"A","Cold"]
[null,"Red WillowNE","Red Willow","NE",31,145,5,"A","Cold"]
[null,"RichardsonNE","Richardson","NE",31,147,5,"A","Cold"]
[null,"RockNE","Rock","NE",31,149,5,"A","Cold"]
[null,"SalineNE","Saline","NE",31,151,5,"A","Cold"]
[null,"SarpyNE","Sarpy","NE",31,153,5,"A","Cold"]
[null,"SaundersNE","Saunders","NE",31,155,5,"A","Cold"]
[null,"Scotts BluffNE","Scotts Bluff","NE",31,157,5,"A","Cold"]
[null,"SewardNE","Seward","NE",31,159,5,"A","Cold"]
[null,"SheridanNE","Sheridan","NE",31,161,5,"A","Cold"]
[null,"ShermanNE","Sherman","NE",31,163,5,"A","Cold"]
[null,"SiouxNE","Sioux","NE",31,165,5,"A","Cold"]
[null,"StantonNE","Stanton","NE",31,167,5,"A","Cold"]
[null,"ThayerNE","Thayer","NE",31,169,5,"A","Cold"]
[null,"ThomasNE","Thomas","NE",31,171,5,"A","Cold"]
[null,"ThurstonNE","Thurston","NE",31,173,5,"A","Cold"]
[null,"ValleyNE","Valley","NE",31,175,5,"A","Cold"]
[null,"WashingtonNE","Washington","NE",31,177,5,"A","Cold"]
[null,"WayneNE","Wayne","NE",31,179,5,"A","Cold"]
[null,"WebsterNE","Webster","NE",31,181,5,"A","Cold"]
[null,"WheelerNE","Wheeler","NE",31,183,5,"A","Cold"]
[null,"YorkNE","York","NE",31,185,5,"A","Cold"]
[null,"BelknapNH","Belknap","NH",33,1,6,"A","Cold"]
[null,"CarrollNH","Carroll","NH",33,3,6,"A","Cold"]
[null,"CheshireNH","Cheshire","NH",33,5,5,"A","Cold"]
[null,"CoosNH","Coos","NH",33,7,6,"A","Cold"]
[null,"GraftonNH","Grafton","NH",33,9,6,"A","Cold"]
[null,"HillsboroughNH","Hillsborough","NH",33,11,5,"A","Cold"]
[null,"MerrimackNH","Merrimack","NH",33,13,6,"A","Cold"]
[null,"RockinghamNH","Rockingham","NH",33,15,5,"A","Cold"]
[null,"StraffordNH","Strafford","NH",33,17,5,"A","Cold"]
[null,"SullivanNH","Sullivan","NH",33,19,6,"A","Cold"]
[null,"AtlanticNJ","Atlantic","NJ",34,1,4,"A","Mixed-Humid"]
[null,{"$f":"CONCATENATE(C1924,D1924)","v":"BergenNJ"},"Bergen","NJ",34,3,5,"A","Cold"]
[null,"BurlingtonNJ","Burlington","NJ",34,5,4,"A","Mixed-Humid"]
[null,"CamdenNJ","Camden","NJ",34,7,4,"A","Mixed-Humid"]
[null,"Cape MayNJ","Cape May","NJ",34,9,4,"A","Mixed-Humid"]
[null,"CumberlandNJ","Cumberland","NJ",34,11,4,"A","Mixed-Humid"]
[null,"EssexNJ","Essex","NJ",34,13,4,"A","Mixed-Humid"]
[null,"GloucesterNJ","Gloucester","NJ",34,15,4,"A","Mixed-Humid"]
[null,"HudsonNJ","Hudson","NJ",34,17,4,"A","Mixed-Humid"]
[null,"HunterdonNJ","Hunterdon","NJ",34,19,5,"A","Cold"]
[null,"MercerNJ","Mercer","NJ",34,21,5,"A","Cold"]
[null,"MiddlesexNJ","Middlesex","NJ",34,23,4,"A","Mixed-Humid"]
[null,"MonmouthNJ","Monmouth","NJ",34,25,4,"A","Mixed-Humid"]
[null,"MorrisNJ","Morris","NJ",34,27,5,"A","Cold"]
[null,"OceanNJ","Ocean","NJ",34,29,4,"A","Mixed-Humid"]
[null,"PassaicNJ","Passaic","NJ",34,31,5,"A","Cold"]
[null,"SalemNJ","Salem","NJ",34,33,4,"A","Mixed-Humid"]
[null,"SomersetNJ","Somerset","NJ",34,35,5,"A","Cold"]
[null,"SussexNJ","Sussex","NJ",34,37,5,"A","Cold"]
[null,"UnionNJ","Union","NJ",34,39,4,"A","Mixed-Humid"]
[null,"WarrenNJ","Warren","NJ",34,41,5,"A","Cold"]
[null,"BernalilloNM","Bernalillo","NM",35,1,4,"B","Mixed-Dry"]
[null,"CatronNM","Catron","NM",35,3,5,"B","Cold"]
[null,"ChavesNM","Chaves","NM",35,5,3,"B","Hot-Dry"]
[null,"CibolaNM","Cibola","NM",35,6,4,"B","Cold"]
[null,"ColfaxNM","Colfax","NM",35,7,5,"B","Cold"]
[null,"CurryNM","Curry","NM",35,9,4,"B","Mixed-Dry"]
[null,"De BacaNM","De Baca","NM",35,11,4,"B","Mixed-Dry"]
[null,"DoÂ–a AnaNM","DoÂ–a Ana","NM",35,13,3,"B","Hot-Dry"]
[null,"EddyNM","Eddy","NM",35,15,3,"B","Hot-Dry"]
[null,"GrantNM","Grant","NM",35,17,4,"B","Mixed-Dry"]
[null,"GuadalupeNM","Guadalupe","NM",35,19,4,"B","Mixed-Dry"]
[null,"HardingNM","Harding","NM",35,21,5,"B","Cold"]
[null,"HidalgoNM","Hidalgo","NM",35,23,3,"B","Hot-Dry"]
[null,"LeaNM","Lea","NM",35,25,3,"B","Hot-Dry"]
[null,"LincolnNM","Lincoln","NM",35,27,4,"B","Mixed-Dry"]
[null,"Los AlamosNM","Los Alamos","NM",35,28,5,"B","Cold"]
[null,"LunaNM","Luna","NM",35,29,3,"B","Hot-Dry"]
[null,"McKinleyNM","McKinley","NM",35,31,5,"B","Cold"]
[null,"MoraNM","Mora","NM",35,33,5,"B","Cold"]
[null,"OteroNM","Otero","NM",35,35,3,"B","Hot-Dry"]
[null,"QuayNM","Quay","NM",35,37,4,"B","Mixed-Dry"]
[null,"Rio ArribaNM","Rio Arriba","NM",35,39,5,"B","Cold"]
[null,"RooseveltNM","Roosevelt","NM",35,41,4,"B","Mixed-Dry"]
[null,"San JuanNM","San Juan","NM",35,45,5,"B","Cold"]
[null,"San MiguelNM","San Miguel","NM",35,47,5,"B","Cold"]
[null,"SandovalNM","Sandoval","NM",35,43,5,"B","Cold"]
[null,"Santa FeNM","Santa Fe","NM",35,49,5,"B","Cold"]
[null,"SierraNM","Sierra","NM",35,51,4,"B","Mixed-Dry"]
[null,"SocorroNM","Socorro","NM",35,53,4,"B","Mixed-Dry"]
[null,"TaosNM","Taos","NM",35,55,5,"B","Cold"]
[null,"TorranceNM","Torrance","NM",35,57,5,"B","Cold"]
[null,"UnionNM","Union","NM",35,59,4,"B","Mixed-Dry"]
[null,"ValenciaNM","Valencia","NM",35,61,4,"B","Mixed-Dry"]
[null,"Carson City (city)NV","Carson City (city)","NV",32,510,5,"B","Cold"]
[null,"ChurchillNV","Churchill","NV",32,1,5,"B","Cold"]
[null,"ClarkNV","Clark","NV",32,3,3,"B","Hot-Dry"]
[null,"DouglasNV","Douglas","NV",32,5,5,"B","Cold"]
[null,"ElkoNV","Elko","NV",32,7,5,"B","Cold"]
[null,"EsmeraldaNV","Esmeralda","NV",32,9,5,"B","Cold"]
[null,"EurekaNV","Eureka","NV",32,11,5,"B","Cold"]
[null,"HumboldtNV","Humboldt","NV",32,13,5,"B","Cold"]
[null,"LanderNV","Lander","NV",32,15,5,"B","Cold"]
[null,"LincolnNV","Lincoln","NV",32,17,5,"B","Cold"]
[null,"LyonNV","Lyon","NV",32,19,5,"B","Cold"]
[null,{"$f":"CONCATENATE(C1988,D1988)","v":"MineralNV"},"Mineral","NV",32,21,5,"B","Cold"]
[null,"NyeNV","Nye","NV",32,23,5,"B","Cold"]
[null,"PershingNV","Pershing","NV",32,27,5,"B","Cold"]
[null,"StoreyNV","Storey","NV",32,29,5,"B","Cold"]
[null,"WashoeNV","Washoe","NV",32,31,5,"B","Cold"]
[null,"White PineNV","White Pine","NV",32,33,5,"B","Cold"]
[null,"AlbanyNY","Albany","NY",36,1,5,"A","Cold"]
[null,"AlleganyNY","Allegany","NY",36,3,6,"A","Cold"]
[null,"BronxNY","Bronx","NY",36,5,4,"A","Mixed-Humid"]
[null,"BroomeNY","Broome","NY",36,7,6,"A","Cold"]
[null,"CattaraugusNY","Cattaraugus","NY",36,9,6,"A","Cold"]
[null,"CayugaNY","Cayuga","NY",36,11,5,"A","Cold"]
[null,"ChautauquaNY","Chautauqua","NY",36,13,5,"A","Cold"]
[null,"ChemungNY","Chemung","NY",36,15,5,"A","Cold"]
[null,"ChenangoNY","Chenango","NY",36,17,6,"A","Cold"]
[null,"ClintonNY","Clinton","NY",36,19,6,"A","Cold"]
[null,"ColumbiaNY","Columbia","NY",36,21,5,"A","Cold"]
[null,"CortlandNY","Cortland","NY",36,23,5,"A","Cold"]
[null,"DelawareNY","Delaware","NY",36,25,6,"A","Cold"]
[null,"DutchessNY","Dutchess","NY",36,27,5,"A","Cold"]
[null,"ErieNY","Erie","NY",36,29,5,"A","Cold"]
[null,"EssexNY","Essex","NY",36,31,6,"A","Cold"]
[null,"FranklinNY","Franklin","NY",36,33,6,"A","Cold"]
[null,"FultonNY","Fulton","NY",36,35,6,"A","Cold"]
[null,"GeneseeNY","Genesee","NY",36,37,5,"A","Cold"]
[null,"GreeneNY","Greene","NY",36,39,5,"A","Cold"]
[null,"HamiltonNY","Hamilton","NY",36,41,6,"A","Cold"]
[null,"HerkimerNY","Herkimer","NY",36,43,6,"A","Cold"]
[null,"JeffersonNY","Jefferson","NY",36,45,6,"A","Cold"]
[null,"KingsNY","Kings","NY",36,47,4,"A","Mixed-Humid"]
[null,"LewisNY","Lewis","NY",36,49,6,"A","Cold"]
[null,"LivingstonNY","Livingston","NY",36,51,5,"A","Cold"]
[null,"MadisonNY","Madison","NY",36,53,6,"A","Cold"]
[null,"MonroeNY","Monroe","NY",36,55,5,"A","Cold"]
[null,"MontgomeryNY","Montgomery","NY",36,57,6,"A","Cold"]
[null,"NassauNY","Nassau","NY",36,59,4,"A","Mixed-Humid"]
[null,"New YorkNY","New York","NY",36,61,4,"A","Mixed-Humid"]
[null,"NiagaraNY","Niagara","NY",36,63,5,"A","Cold"]
[null,"OneidaNY","Oneida","NY",36,65,6,"A","Cold"]
[null,"OnondagaNY","Onondaga","NY",36,67,5,"A","Cold"]
[null,"OntarioNY","Ontario","NY",36,69,5,"A","Cold"]
[null,"OrangeNY","Orange","NY",36,71,5,"A","Cold"]
[null,"OrleansNY","Orleans","NY",36,73,5,"A","Cold"]
[null,"OswegoNY","Oswego","NY",36,75,5,"A","Cold"]
[null,"OtsegoNY","Otsego","NY",36,77,6,"A","Cold"]
[null,"PutnamNY","Putnam","NY",36,79,5,"A","Cold"]
[null,"QueensNY","Queens","NY",36,81,4,"A","Mixed-Humid"]
[null,"RensselaerNY","Rensselaer","NY",36,83,5,"A","Cold"]
[null,"RichmondNY","Richmond","NY",36,85,4,"A","Mixed-Humid"]
[null,"RocklandNY","Rockland","NY",36,87,5,"A","Cold"]
[null,"SaratogaNY","Saratoga","NY",36,91,5,"A","Cold"]
[null,"SchenectadyNY","Schenectady","NY",36,93,5,"A","Cold"]
[null,"SchoharieNY","Schoharie","NY",36,95,6,"A","Cold"]
[null,"SchuylerNY","Schuyler","NY",36,97,6,"A","Cold"]
[null,"SenecaNY","Seneca","NY",36,99,5,"A","Cold"]
[null,"St. LawrenceNY","St. Lawrence","NY",36,89,6,"A","Cold"]
[null,"SteubenNY","Steuben","NY",36,101,6,"A","Cold"]
[null,"SuffolkNY","Suffolk","NY",36,103,4,"A","Mixed-Humid"]
[null,"SullivanNY","Sullivan","NY",36,105,6,"A","Cold"]
[null,"TiogaNY","Tioga","NY",36,107,5,"A","Cold"]
[null,"TompkinsNY","Tompkins","NY",36,109,6,"A","Cold"]
[null,"UlsterNY","Ulster","NY",36,111,6,"A","Cold"]
[null,"WarrenNY","Warren","NY",36,113,6,"A","Cold"]
[null,"WashingtonNY","Washington","NY",36,115,5,"A","Cold"]
[null,{"$f":"CONCATENATE(C2052,D2052)","v":"WayneNY"},"Wayne","NY",36,117,5,"A","Cold"]
[null,"WestchesterNY","Westchester","NY",36,119,4,"A","Mixed-Humid"]
[null,"WyomingNY","Wyoming","NY",36,121,6,"A","Cold"]
[null,"YatesNY","Yates","NY",36,123,5,"A","Cold"]
[null,"AdamsOH","Adams","OH",39,1,4,"A","Mixed-Humid"]
[null,"AllenOH","Allen","OH",39,3,5,"A","Cold"]
[null,"AshlandOH","Ashland","OH",39,5,5,"A","Cold"]
[null,"AshtabulaOH","Ashtabula","OH",39,7,5,"A","Cold"]
[null,"AthensOH","Athens","OH",39,9,5,"A","Cold"]
[null,"AuglaizeOH","Auglaize","OH",39,11,5,"A","Cold"]
[null,"BelmontOH","Belmont","OH",39,13,5,"A","Cold"]
[null,"BrownOH","Brown","OH",39,15,4,"A","Mixed-Humid"]
[null,"ButlerOH","Butler","OH",39,17,5,"A","Cold"]
[null,"CarrollOH","Carroll","OH",39,19,5,"A","Cold"]
[null,"ChampaignOH","Champaign","OH",39,21,5,"A","Cold"]
[null,"ClarkOH","Clark","OH",39,23,5,"A","Cold"]
[null,"ClermontOH","Clermont","OH",39,25,4,"A","Mixed-Humid"]
[null,"ClintonOH","Clinton","OH",39,27,5,"A","Cold"]
[null,"ColumbianaOH","Columbiana","OH",39,29,5,"A","Cold"]
[null,"CoshoctonOH","Coshocton","OH",39,31,5,"A","Cold"]
[null,"CrawfordOH","Crawford","OH",39,33,5,"A","Cold"]
[null,"CuyahogaOH","Cuyahoga","OH",39,35,5,"A","Cold"]
[null,"DarkeOH","Darke","OH",39,37,5,"A","Cold"]
[null,"DefianceOH","Defiance","OH",39,39,5,"A","Cold"]
[null,"DelawareOH","Delaware","OH",39,41,5,"A","Cold"]
[null,"ErieOH","Erie","OH",39,43,5,"A","Cold"]
[null,"FairfieldOH","Fairfield","OH",39,45,5,"A","Cold"]
[null,"FayetteOH","Fayette","OH",39,47,5,"A","Cold"]
[null,"FranklinOH","Franklin","OH",39,49,5,"A","Cold"]
[null,"FultonOH","Fulton","OH",39,51,5,"A","Cold"]
[null,"GalliaOH","Gallia","OH",39,53,4,"A","Mixed-Humid"]
[null,"GeaugaOH","Geauga","OH",39,55,5,"A","Cold"]
[null,"GreeneOH","Greene","OH",39,57,5,"A","Cold"]
[null,"GuernseyOH","Guernsey","OH",39,59,5,"A","Cold"]
[null,"HamiltonOH","Hamilton","OH",39,61,4,"A","Mixed-Humid"]
[null,"HancockOH","Hancock","OH",39,63,5,"A","Cold"]
[null,"HardinOH","Hardin","OH",39,65,5,"A","Cold"]
[null,"HarrisonOH","Harrison","OH",39,67,5,"A","Cold"]
[null,"HenryOH","Henry","OH",39,69,5,"A","Cold"]
[null,"HighlandOH","Highland","OH",39,71,5,"A","Cold"]
[null,"HockingOH","Hocking","OH",39,73,5,"A","Cold"]
[null,"HolmesOH","Holmes","OH",39,75,5,"A","Cold"]
[null,"HuronOH","Huron","OH",39,77,5,"A","Cold"]
[null,"JacksonOH","Jackson","OH",39,79,5,"A","Cold"]
[null,"JeffersonOH","Jefferson","OH",39,81,5,"A","Cold"]
[null,"KnoxOH","Knox","OH",39,83,5,"A","Cold"]
[null,"LakeOH","Lake","OH",39,85,5,"A","Cold"]
[null,"LawrenceOH","Lawrence","OH",39,87,4,"A","Mixed-Humid"]
[null,"LickingOH","Licking","OH",39,89,5,"A","Cold"]
[null,"LoganOH","Logan","OH",39,91,5,"A","Cold"]
[null,"LorainOH","Lorain","OH",39,93,5,"A","Cold"]
[null,"LucasOH","Lucas","OH",39,95,5,"A","Cold"]
[null,"MadisonOH","Madison","OH",39,97,5,"A","Cold"]
[null,"MahoningOH","Mahoning","OH",39,99,5,"A","Cold"]
[null,"MarionOH","Marion","OH",39,101,5,"A","Cold"]
[null,"MedinaOH","Medina","OH",39,103,5,"A","Cold"]
[null,"MeigsOH","Meigs","OH",39,105,5,"A","Cold"]
[null,"MercerOH","Mercer","OH",39,107,5,"A","Cold"]
[null,"MiamiOH","Miami","OH",39,109,5,"A","Cold"]
[null,"MonroeOH","Monroe","OH",39,111,5,"A","Cold"]
[null,"MontgomeryOH","Montgomery","OH",39,113,5,"A","Cold"]
[null,"MorganOH","Morgan","OH",39,115,5,"A","Cold"]
[null,"MorrowOH","Morrow","OH",39,117,5,"A","Cold"]
[null,"MuskingumOH","Muskingum","OH",39,119,5,"A","Cold"]
[null,{"$f":"CONCATENATE(C2116,D2116)","v":"NobleOH"},"Noble","OH",39,121,5,"A","Cold"]
[null,"OttawaOH","Ottawa","OH",39,123,5,"A","Cold"]
[null,"PauldingOH","Paulding","OH",39,125,5,"A","Cold"]
[null,"PerryOH","Perry","OH",39,127,5,"A","Cold"]
[null,"PickawayOH","Pickaway","OH",39,129,5,"A","Cold"]
[null,"PikeOH","Pike","OH",39,131,4,"A","Mixed-Humid"]
[null,"PortageOH","Portage","OH",39,133,5,"A","Cold"]
[null,"PrebleOH","Preble","OH",39,135,5,"A","Cold"]
[null,"PutnamOH","Putnam","OH",39,137,5,"A","Cold"]
[null,"RichlandOH","Richland","OH",39,139,5,"A","Cold"]
[null,"RossOH","Ross","OH",39,141,5,"A","Cold"]
[null,"SanduskyOH","Sandusky","OH",39,143,5,"A","Cold"]
[null,"SciotoOH","Scioto","OH",39,145,4,"A","Mixed-Humid"]
[null,"SenecaOH","Seneca","OH",39,147,5,"A","Cold"]
[null,"ShelbyOH","Shelby","OH",39,149,5,"A","Cold"]
[null,"StarkOH","Stark","OH",39,151,5,"A","Cold"]
[null,"SummitOH","Summit","OH",39,153,5,"A","Cold"]
[null,"TrumbullOH","Trumbull","OH",39,155,5,"A","Cold"]
[null,"TuscarawasOH","Tuscarawas","OH",39,157,5,"A","Cold"]
[null,"UnionOH","Union","OH",39,159,5,"A","Cold"]
[null,"Van WertOH","Van Wert","OH",39,161,5,"A","Cold"]
[null,"VintonOH","Vinton","OH",39,163,5,"A","Cold"]
[null,"WarrenOH","Warren","OH",39,165,5,"A","Cold"]
[null,"WashingtonOH","Washington","OH",39,167,4,"A","Mixed-Humid"]
[null,"WayneOH","Wayne","OH",39,169,5,"A","Cold"]
[null,"WilliamsOH","Williams","OH",39,171,5,"A","Cold"]
[null,"WoodOH","Wood","OH",39,173,5,"A","Cold"]
[null,"WyandotOH","Wyandot","OH",39,175,5,"A","Cold"]
[null,"AdairOK","Adair","OK",40,1,3,"A","Mixed-Humid"]
[null,"AlfalfaOK","Alfalfa","OK",40,3,3,"A","Mixed-Humid"]
[null,"AtokaOK","Atoka","OK",40,5,3,"A","Mixed-Humid"]
[null,"BeaverOK","Beaver","OK",40,7,4,"B","Mixed-Dry"]
[null,"BeckhamOK","Beckham","OK",40,9,3,"A","Mixed-Humid"]
[null,"BlaineOK","Blaine","OK",40,11,3,"A","Mixed-Humid"]
[null,"BryanOK","Bryan","OK",40,13,3,"A","Mixed-Humid"]
[null,"CaddoOK","Caddo","OK",40,15,3,"A","Mixed-Humid"]
[null,"CanadianOK","Canadian","OK",40,17,3,"A","Mixed-Humid"]
[null,"CarterOK","Carter","OK",40,19,3,"A","Mixed-Humid"]
[null,"CherokeeOK","Cherokee","OK",40,21,3,"A","Mixed-Humid"]
[null,"ChoctawOK","Choctaw","OK",40,23,3,"A","Mixed-Humid"]
[null,"CimarronOK","Cimarron","OK",40,25,4,"B","Mixed-Dry"]
[null,"ClevelandOK","Cleveland","OK",40,27,3,"A","Mixed-Humid"]
[null,"CoalOK","Coal","OK",40,29,3,"A","Mixed-Humid"]
[null,"ComancheOK","Comanche","OK",40,31,3,"A","Mixed-Humid"]
[null,"CottonOK","Cotton","OK",40,33,3,"A","Mixed-Humid"]
[null,"CraigOK","Craig","OK",40,35,3,"A","Mixed-Humid"]
[null,"CreekOK","Creek","OK",40,37,3,"A","Mixed-Humid"]
[null,"CusterOK","Custer","OK",40,39,3,"A","Mixed-Humid"]
[null,"DelawareOK","Delaware","OK",40,41,3,"A","Mixed-Humid"]
[null,"DeweyOK","Dewey","OK",40,43,3,"A","Mixed-Humid"]
[null,"EllisOK","Ellis","OK",40,45,3,"A","Mixed-Humid"]
[null,"GarfieldOK","Garfield","OK",40,47,3,"A","Mixed-Humid"]
[null,"GarvinOK","Garvin","OK",40,49,3,"A","Mixed-Humid"]
[null,"GradyOK","Grady","OK",40,51,3,"A","Mixed-Humid"]
[null,"GrantOK","Grant","OK",40,53,3,"A","Mixed-Humid"]
[null,"GreerOK","Greer","OK",40,55,3,"A","Mixed-Humid"]
[null,"HarmonOK","Harmon","OK",40,57,3,"A","Mixed-Humid"]
[null,"HarperOK","Harper","OK",40,59,3,"A","Mixed-Humid"]
[null,"HaskellOK","Haskell","OK",40,61,3,"A","Mixed-Humid"]
[null,"HughesOK","Hughes","OK",40,63,3,"A","Mixed-Humid"]
[null,"JacksonOK","Jackson","OK",40,65,3,"A","Mixed-Humid"]
[null,"JeffersonOK","Jefferson","OK",40,67,3,"A","Mixed-Humid"]
[null,"JohnstonOK","Johnston","OK",40,69,3,"A","Mixed-Humid"]
[null,"KayOK","Kay","OK",40,71,3,"A","Mixed-Humid"]
[null,{"$f":"CONCATENATE(C2180,D2180)","v":"KingfisherOK"},"Kingfisher","OK",40,73,3,"A","Mixed-Humid"]
[null,"KiowaOK","Kiowa","OK",40,75,3,"A","Mixed-Humid"]
[null,"LatimerOK","Latimer","OK",40,77,3,"A","Mixed-Humid"]
[null,"Le FloreOK","Le Flore","OK",40,79,3,"A","Mixed-Humid"]
[null,"LincolnOK","Lincoln","OK",40,81,3,"A","Mixed-Humid"]
[null,"LoganOK","Logan","OK",40,83,3,"A","Mixed-Humid"]
[null,"LoveOK","Love","OK",40,85,3,"A","Mixed-Humid"]
[null,"MajorOK","Major","OK",40,93,3,"A","Mixed-Humid"]
[null,"MarshallOK","Marshall","OK",40,95,3,"A","Mixed-Humid"]
[null,"MayesOK","Mayes","OK",40,97,3,"A","Mixed-Humid"]
[null,"McClainOK","McClain","OK",40,87,3,"A","Mixed-Humid"]
[null,"McCurtainOK","McCurtain","OK",40,89,3,"A","Mixed-Humid"]
[null,"McIntoshOK","McIntosh","OK",40,91,3,"A","Mixed-Humid"]
[null,"MurrayOK","Murray","OK",40,99,3,"A","Mixed-Humid"]
[null,"MuskogeeOK","Muskogee","OK",40,101,3,"A","Mixed-Humid"]
[null,"NobleOK","Noble","OK",40,103,3,"A","Mixed-Humid"]
[null,"NowataOK","Nowata","OK",40,105,3,"A","Mixed-Humid"]
[null,"OkfuskeeOK","Okfuskee","OK",40,107,3,"A","Mixed-Humid"]
[null,"OklahomaOK","Oklahoma","OK",40,109,3,"A","Mixed-Humid"]
[null,"OkmulgeeOK","Okmulgee","OK",40,111,3,"A","Mixed-Humid"]
[null,"OsageOK","Osage","OK",40,113,3,"A","Mixed-Humid"]
[null,"OttawaOK","Ottawa","OK",40,115,3,"A","Mixed-Humid"]
[null,"PawneeOK","Pawnee","OK",40,117,3,"A","Mixed-Humid"]
[null,"PayneOK","Payne","OK",40,119,3,"A","Mixed-Humid"]
[null,"PittsburgOK","Pittsburg","OK",40,121,3,"A","Mixed-Humid"]
[null,"PontotocOK","Pontotoc","OK",40,123,3,"A","Mixed-Humid"]
[null,"PottawatomieOK","Pottawatomie","OK",40,125,3,"A","Mixed-Humid"]
[null,"PushmatahaOK","Pushmataha","OK",40,127,3,"A","Mixed-Humid"]
[null,"Roger MillsOK","Roger Mills","OK",40,129,3,"A","Mixed-Humid"]
[null,"RogersOK","Rogers","OK",40,131,3,"A","Mixed-Humid"]
[null,"SeminoleOK","Seminole","OK",40,133,3,"A","Mixed-Humid"]
[null,"SequoyahOK","Sequoyah","OK",40,135,3,"A","Mixed-Humid"]
[null,"StephensOK","Stephens","OK",40,137,3,"A","Mixed-Humid"]
[null,"TexasOK","Texas","OK",40,139,4,"B","Mixed-Dry"]
[null,"TillmanOK","Tillman","OK",40,141,3,"A","Mixed-Humid"]
[null,"TulsaOK","Tulsa","OK",40,143,3,"A","Mixed-Humid"]
[null,"WagonerOK","Wagoner","OK",40,145,3,"A","Mixed-Humid"]
[null,"WashingtonOK","Washington","OK",40,147,3,"A","Mixed-Humid"]
[null,"WashitaOK","Washita","OK",40,149,3,"A","Mixed-Humid"]
[null,"WoodsOK","Woods","OK",40,151,3,"A","Mixed-Humid"]
[null,"WoodwardOK","Woodward","OK",40,153,3,"A","Mixed-Humid"]
[null,"BakerOR","Baker","OR",41,1,5,"B","Cold"]
[null,"BentonOR","Benton","OR",41,3,4,"C","Marine"]
[null,"ClackamasOR","Clackamas","OR",41,5,4,"C","Marine"]
[null,"ClatsopOR","Clatsop","OR",41,7,4,"C","Marine"]
[null,"ColumbiaOR","Columbia","OR",41,9,4,"C","Marine"]
[null,"CoosOR","Coos","OR",41,11,4,"C","Marine"]
[null,"CrookOR","Crook","OR",41,13,5,"B","Cold"]
[null,"CurryOR","Curry","OR",41,15,4,"C","Marine"]
[null,"DeschutesOR","Deschutes","OR",41,17,5,"B","Cold"]
[null,"DouglasOR","Douglas","OR",41,19,4,"C","Marine"]
[null,"GilliamOR","Gilliam","OR",41,21,5,"B","Cold"]
[null,"GrantOR","Grant","OR",41,23,5,"B","Cold"]
[null,"HarneyOR","Harney","OR",41,25,5,"B","Cold"]
[null,"Hood RiverOR","Hood River","OR",41,27,5,"B","Cold"]
[null,"JacksonOR","Jackson","OR",41,29,4,"C","Marine"]
[null,"JeffersonOR","Jefferson","OR",41,31,5,"B","Cold"]
[null,"JosephineOR","Josephine","OR",41,33,4,"C","Marine"]
[null,"KlamathOR","Klamath","OR",41,35,5,"B","Cold"]
[null,"LakeOR","Lake","OR",41,37,5,"B","Cold"]
[null,"LaneOR","Lane","OR",41,39,4,"C","Marine"]
[null,"LincolnOR","Lincoln","OR",41,41,4,"C","Marine"]
[null,"LinnOR","Linn","OR",41,43,4,"C","Marine"]
[null,"MalheurOR","Malheur","OR",41,45,5,"B","Cold"]
[null,{"$f":"CONCATENATE(C2244,D2244)","v":"MarionOR"},"Marion","OR",41,47,4,"C","Marine"]
[null,"MorrowOR","Morrow","OR",41,49,5,"B","Cold"]
[null,"MultnomahOR","Multnomah","OR",41,51,4,"C","Marine"]
[null,"PolkOR","Polk","OR",41,53,4,"C","Marine"]
[null,"ShermanOR","Sherman","OR",41,55,5,"B","Cold"]
[null,"TillamookOR","Tillamook","OR",41,57,4,"C","Marine"]
[null,"UmatillaOR","Umatilla","OR",41,59,5,"B","Cold"]
[null,"UnionOR","Union","OR",41,61,5,"B","Cold"]
[null,"WallowaOR","Wallowa","OR",41,63,5,"B","Cold"]
[null,"WascoOR","Wasco","OR",41,65,5,"B","Cold"]
[null,"WashingtonOR","Washington","OR",41,67,4,"C","Marine"]
[null,"WheelerOR","Wheeler","OR",41,69,5,"B","Cold"]
[null,"YamhillOR","Yamhill","OR",41,71,4,"C","Marine"]
[null,"AdamsPA","Adams","PA",42,1,5,"A","Cold"]
[null,"AlleghenyPA","Allegheny","PA",42,3,5,"A","Cold"]
[null,"ArmstrongPA","Armstrong","PA",42,5,5,"A","Cold"]
[null,"BeaverPA","Beaver","PA",42,7,5,"A","Cold"]
[null,"BedfordPA","Bedford","PA",42,9,5,"A","Cold"]
[null,"BerksPA","Berks","PA",42,11,5,"A","Cold"]
[null,"BlairPA","Blair","PA",42,13,5,"A","Cold"]
[null,"BradfordPA","Bradford","PA",42,15,5,"A","Cold"]
[null,"BucksPA","Bucks","PA",42,17,4,"A","Mixed-Humid"]
[null,"ButlerPA","Butler","PA",42,19,5,"A","Cold"]
[null,"CambriaPA","Cambria","PA",42,21,5,"A","Cold"]
[null,"CameronPA","Cameron","PA",42,23,6,"A","Cold"]
[null,"CarbonPA","Carbon","PA",42,25,5,"A","Cold"]
[null,"CentrePA","Centre","PA",42,27,5,"A","Cold"]
[null,"ChesterPA","Chester","PA",42,29,4,"A","Mixed-Humid"]
[null,"ClarionPA","Clarion","PA",42,31,5,"A","Cold"]
[null,"ClearfieldPA","Clearfield","PA",42,33,6,"A","Cold"]
[null,"ClintonPA","Clinton","PA",42,35,5,"A","Cold"]
[null,"ColumbiaPA","Columbia","PA",42,37,5,"A","Cold"]
[null,"CrawfordPA","Crawford","PA",42,39,5,"A","Cold"]
[null,"CumberlandPA","Cumberland","PA",42,41,5,"A","Cold"]
[null,"DauphinPA","Dauphin","PA",42,43,5,"A","Cold"]
[null,"DelawarePA","Delaware","PA",42,45,4,"A","Mixed-Humid"]
[null,"ElkPA","Elk","PA",42,47,6,"A","Cold"]
[null,"EriePA","Erie","PA",42,49,5,"A","Cold"]
[null,"FayettePA","Fayette","PA",42,51,5,"A","Cold"]
[null,"ForestPA","Forest","PA",42,53,5,"A","Cold"]
[null,"FranklinPA","Franklin","PA",42,55,5,"A","Cold"]
[null,"FultonPA","Fulton","PA",42,57,5,"A","Cold"]
[null,"GreenePA","Greene","PA",42,59,5,"A","Cold"]
[null,"HuntingdonPA","Huntingdon","PA",42,61,5,"A","Cold"]
[null,"IndianaPA","Indiana","PA",42,63,5,"A","Cold"]
[null,"JeffersonPA","Jefferson","PA",42,65,5,"A","Cold"]
[null,"JuniataPA","Juniata","PA",42,67,5,"A","Cold"]
[null,"LackawannaPA","Lackawanna","PA",42,69,5,"A","Cold"]
[null,"LancasterPA","Lancaster","PA",42,71,5,"A","Cold"]
[null,"LawrencePA","Lawrence","PA",42,73,5,"A","Cold"]
[null,"LebanonPA","Lebanon","PA",42,75,5,"A","Cold"]
[null,"LehighPA","Lehigh","PA",42,77,5,"A","Cold"]
[null,"LuzernePA","Luzerne","PA",42,79,5,"A","Cold"]
[null,"LycomingPA","Lycoming","PA",42,81,5,"A","Cold"]
[null,"McKeanPA","McKean","PA",42,83,6,"A","Cold"]
[null,"MercerPA","Mercer","PA",42,85,5,"A","Cold"]
[null,"MifflinPA","Mifflin","PA",42,87,5,"A","Cold"]
[null,"MonroePA","Monroe","PA",42,89,5,"A","Cold"]
[null,"MontgomeryPA","Montgomery","PA",42,91,4,"A","Mixed-Humid"]
[null,"MontourPA","Montour","PA",42,93,5,"A","Cold"]
[null,"NorthamptonPA","Northampton","PA",42,95,5,"A","Cold"]
[null,"NorthumberlandPA","Northumberland","PA",42,97,5,"A","Cold"]
[null,"PerryPA","Perry","PA",42,99,5,"A","Cold"]
[null,"PhiladelphiaPA","Philadelphia","PA",42,101,4,"A","Mixed-Humid"]
[null,{"$f":"CONCATENATE(C2308,D2308)","v":"PikePA"},"Pike","PA",42,103,5,"A","Cold"]
[null,"PotterPA","Potter","PA",42,105,6,"A","Cold"]
[null,"SchuylkillPA","Schuylkill","PA",42,107,5,"A","Cold"]
[null,"SnyderPA","Snyder","PA",42,109,5,"A","Cold"]
[null,"SomersetPA","Somerset","PA",42,111,5,"A","Cold"]
[null,"SullivanPA","Sullivan","PA",42,113,5,"A","Cold"]
[null,"SusquehannaPA","Susquehanna","PA",42,115,6,"A","Cold"]
[null,"TiogaPA","Tioga","PA",42,117,6,"A","Cold"]
[null,"UnionPA","Union","PA",42,119,5,"A","Cold"]
[null,"VenangoPA","Venango","PA",42,121,5,"A","Cold"]
[null,"WarrenPA","Warren","PA",42,123,5,"A","Cold"]
[null,"WashingtonPA","Washington","PA",42,125,5,"A","Cold"]
[null,"WaynePA","Wayne","PA",42,127,6,"A","Cold"]
[null,"WestmorelandPA","Westmoreland","PA",42,129,5,"A","Cold"]
[null,"WyomingPA","Wyoming","PA",42,131,5,"A","Cold"]
[null,"YorkPA","York","PA",42,133,4,"A","Mixed-Humid"]
[null,"AdjuntasPR","Adjuntas","PR",72,1,1,"A","Hot-Humid"]
[null,"AguadaPR","Aguada","PR",72,3,1,"A","Hot-Humid"]
[null,"AguadillaPR","Aguadilla","PR",72,5,1,"A","Hot-Humid"]
[null,"Aguas BuenasPR","Aguas Buenas","PR",72,7,1,"A","Hot-Humid"]
[null,"AibonitoPR","Aibonito","PR",72,9,1,"A","Hot-Humid"]
[null,"AnascoPR","Anasco","PR",72,11,1,"A","Hot-Humid"]
[null,"AreciboPR","Arecibo","PR",72,13,1,"A","Hot-Humid"]
[null,"ArroyoPR","Arroyo","PR",72,15,1,"A","Hot-Humid"]
[null,"BarcelonetaPR","Barceloneta","PR",72,17,1,"A","Hot-Humid"]
[null,"BarranquitasPR","Barranquitas","PR",72,19,1,"A","Hot-Humid"]
[null,"BayamonPR","Bayamon","PR",72,21,1,"A","Hot-Humid"]
[null,"Cabo RojoPR","Cabo Rojo","PR",72,23,1,"A","Hot-Humid"]
[null,"CaguasPR","Caguas","PR",72,25,1,"A","Hot-Humid"]
[null,"CamuyPR","Camuy","PR",72,27,1,"A","Hot-Humid"]
[null,"CanovanasPR","Canovanas","PR",72,29,1,"A","Hot-Humid"]
[null,"CarolinaPR","Carolina","PR",72,31,1,"A","Hot-Humid"]
[null,"CatanoPR","Catano","PR",72,33,1,"A","Hot-Humid"]
[null,"CayeyPR","Cayey","PR",72,35,1,"A","Hot-Humid"]
[null,"CeibaPR","Ceiba","PR",72,37,1,"A","Hot-Humid"]
[null,"CialesPR","Ciales","PR",72,39,1,"A","Hot-Humid"]
[null,"CidraPR","Cidra","PR",72,41,1,"A","Hot-Humid"]
[null,"CoamoPR","Coamo","PR",72,43,1,"A","Hot-Humid"]
[null,"ComerioPR","Comerio","PR",72,45,1,"A","Hot-Humid"]
[null,"CorozalPR","Corozal","PR",72,47,1,"A","Hot-Humid"]
[null,"CulebraPR","Culebra","PR",72,49,1,"A","Hot-Humid"]
[null,"DoradoPR","Dorado","PR",72,51,1,"A","Hot-Humid"]
[null,"FajardoPR","Fajardo","PR",72,53,1,"A","Hot-Humid"]
[null,"FloridaPR","Florida","PR",72,54,1,"A","Hot-Humid"]
[null,"GuanicaPR","Guanica","PR",72,55,1,"A","Hot-Humid"]
[null,"GuayamaPR","Guayama","PR",72,57,1,"A","Hot-Humid"]
[null,"GuayanillaPR","Guayanilla","PR",72,59,1,"A","Hot-Humid"]
[null,"GuaynaboPR","Guaynabo","PR",72,61,1,"A","Hot-Humid"]
[null,"GuraboPR","Gurabo","PR",72,63,1,"A","Hot-Humid"]
[null,"HatilloPR","Hatillo","PR",72,65,1,"A","Hot-Humid"]
[null,"HormiguerosPR","Hormigueros","PR",72,67,1,"A","Hot-Humid"]
[null,"HumacaoPR","Humacao","PR",72,69,1,"A","Hot-Humid"]
[null,"IsabelaPR","Isabela","PR",72,71,1,"A","Hot-Humid"]
[null,"JayuyaPR","Jayuya","PR",72,73,1,"A","Hot-Humid"]
[null,"Juana DiazPR","Juana Diaz","PR",72,75,1,"A","Hot-Humid"]
[null,"JuncosPR","Juncos","PR",72,77,1,"A","Hot-Humid"]
[null,"LajasPR","Lajas","PR",72,79,1,"A","Hot-Humid"]
[null,"LaresPR","Lares","PR",72,81,1,"A","Hot-Humid"]
[null,"Las MariasPR","Las Marias","PR",72,83,1,"A","Hot-Humid"]
[null,"Las PiedrasPR","Las Piedras","PR",72,85,1,"A","Hot-Humid"]
[null,"LoizaPR","Loiza","PR",72,87,1,"A","Hot-Humid"]
[null,"LuquilloPR","Luquillo","PR",72,89,1,"A","Hot-Humid"]
[null,"ManatiPR","Manati","PR",72,91,1,"A","Hot-Humid"]
[null,"MaricaoPR","Maricao","PR",72,93,1,"A","Hot-Humid"]
[null,{"$f":"CONCATENATE(C2372,D2372)","v":"MaunaboPR"},"Maunabo","PR",72,95,1,"A","Hot-Humid"]
[null,"MayaguezPR","Mayaguez","PR",72,97,1,"A","Hot-Humid"]
[null,"MocaPR","Moca","PR",72,99,1,"A","Hot-Humid"]
[null,"MorovisPR","Morovis","PR",72,101,1,"A","Hot-Humid"]
[null,"NaguaboPR","Naguabo","PR",72,103,1,"A","Hot-Humid"]
[null,"NaranjitoPR","Naranjito","PR",72,105,1,"A","Hot-Humid"]
[null,"OrocovisPR","Orocovis","PR",72,107,1,"A","Hot-Humid"]
[null,"PatillasPR","Patillas","PR",72,109,1,"A","Hot-Humid"]
[null,"PenuelasPR","Penuelas","PR",72,111,1,"A","Hot-Humid"]
[null,"PoncePR","Ponce","PR",72,113,1,"A","Hot-Humid"]
[null,"QuebradillasPR","Quebradillas","PR",72,115,1,"A","Hot-Humid"]
[null,"RinconPR","Rincon","PR",72,117,1,"A","Hot-Humid"]
[null,"Rio GrandePR","Rio Grande","PR",72,119,1,"A","Hot-Humid"]
[null,"Sabana GrandePR","Sabana Grande","PR",72,121,1,"A","Hot-Humid"]
[null,"SalinasPR","Salinas","PR",72,123,1,"A","Hot-Humid"]
[null,"San GermanPR","San German","PR",72,125,1,"A","Hot-Humid"]
[null,"San JuanPR","San Juan","PR",72,127,1,"A","Hot-Humid"]
[null,"San LorenzoPR","San Lorenzo","PR",72,129,1,"A","Hot-Humid"]
[null,"San SebastianPR","San Sebastian","PR",72,131,1,"A","Hot-Humid"]
[null,"Santa IsabelPR","Santa Isabel","PR",72,133,1,"A","Hot-Humid"]
[null,"Toa AltaPR","Toa Alta","PR",72,135,1,"A","Hot-Humid"]
[null,"Toa BajaPR","Toa Baja","PR",72,137,1,"A","Hot-Humid"]
[null,"Trujillo AltoPR","Trujillo Alto","PR",72,139,1,"A","Hot-Humid"]
[null,"UtuadoPR","Utuado","PR",72,141,1,"A","Hot-Humid"]
[null,"Vega AltaPR","Vega Alta","PR",72,143,1,"A","Hot-Humid"]
[null,"Vega BajaPR","Vega Baja","PR",72,145,1,"A","Hot-Humid"]
[null,"ViequesPR","Vieques","PR",72,147,1,"A","Hot-Humid"]
[null,"VillalbaPR","Villalba","PR",72,149,1,"A","Hot-Humid"]
[null,"YabucoaPR","Yabucoa","PR",72,151,1,"A","Hot-Humid"]
[null,"YaucoPR","Yauco","PR",72,153,1,"A","Hot-Humid"]
[null,"BristolRI","Bristol","RI",44,1,5,"A","Cold"]
[null,"KentRI","Kent","RI",44,3,5,"A","Cold"]
[null,"NewportRI","Newport","RI",44,5,5,"A","Cold"]
[null,"ProvidenceRI","Providence","RI",44,7,5,"A","Cold"]
[null,"WashingtonRI","Washington","RI",44,9,5,"A","Cold"]
[null,"AbbevilleSC","Abbeville","SC",45,1,3,"A","Mixed-Humid"]
[null,"AikenSC","Aiken","SC",45,3,3,"A","Mixed-Humid"]
[null,"AllendaleSC","Allendale","SC",45,5,3,"A","Hot-Humid"]
[null,"AndersonSC","Anderson","SC",45,7,3,"A","Mixed-Humid"]
[null,"BambergSC","Bamberg","SC",45,9,3,"A","Hot-Humid"]
[null,"BarnwellSC","Barnwell","SC",45,11,3,"A","Hot-Humid"]
[null,"BeaufortSC","Beaufort","SC",45,13,3,"A","Hot-Humid"]
[null,"BerkeleySC","Berkeley","SC",45,15,3,"A","Hot-Humid"]
[null,"CalhounSC","Calhoun","SC",45,17,3,"A","Mixed-Humid"]
[null,"CharlestonSC","Charleston","SC",45,19,3,"A","Hot-Humid"]
[null,"CherokeeSC","Cherokee","SC",45,21,3,"A","Mixed-Humid"]
[null,"ChesterSC","Chester","SC",45,23,3,"A","Mixed-Humid"]
[null,"ChesterfieldSC","Chesterfield","SC",45,25,3,"A","Mixed-Humid"]
[null,"ClarendonSC","Clarendon","SC",45,27,3,"A","Mixed-Humid"]
[null,"ColletonSC","Colleton","SC",45,29,3,"A","Hot-Humid"]
[null,"DarlingtonSC","Darlington","SC",45,31,3,"A","Mixed-Humid"]
[null,"DillonSC","Dillon","SC",45,33,3,"A","Mixed-Humid"]
[null,"DorchesterSC","Dorchester","SC",45,35,3,"A","Hot-Humid"]
[null,"EdgefieldSC","Edgefield","SC",45,37,3,"A","Mixed-Humid"]
[null,"FairfieldSC","Fairfield","SC",45,39,3,"A","Mixed-Humid"]
[null,"FlorenceSC","Florence","SC",45,41,3,"A","Mixed-Humid"]
[null,"GeorgetownSC","Georgetown","SC",45,43,3,"A","Hot-Humid"]
[null,"GreenvilleSC","Greenville","SC",45,45,3,"A","Mixed-Humid"]
[null,"GreenwoodSC","Greenwood","SC",45,47,3,"A","Mixed-Humid"]
[null,"HamptonSC","Hampton","SC",45,49,3,"A","Hot-Humid"]
[null,"HorrySC","Horry","SC",45,51,3,"A","Hot-Humid"]
[null,"JasperSC","Jasper","SC",45,53,3,"A","Hot-Humid"]
[null,"KershawSC","Kershaw","SC",45,55,3,"A","Mixed-Humid"]
[null,"LancasterSC","Lancaster","SC",45,57,3,"A","Mixed-Humid"]
[null,{"$f":"CONCATENATE(C2436,D2436)","v":"LaurensSC"},"Laurens","SC",45,59,3,"A","Mixed-Humid"]
[null,"LeeSC","Lee","SC",45,61,3,"A","Mixed-Humid"]
[null,"LexingtonSC","Lexington","SC",45,63,3,"A","Mixed-Humid"]
[null,"MarionSC","Marion","SC",45,67,3,"A","Mixed-Humid"]
[null,"MarlboroSC","Marlboro","SC",45,69,3,"A","Mixed-Humid"]
[null,"McCormickSC","McCormick","SC",45,65,3,"A","Mixed-Humid"]
[null,"NewberrySC","Newberry","SC",45,71,3,"A","Mixed-Humid"]
[null,"OconeeSC","Oconee","SC",45,73,3,"A","Mixed-Humid"]
[null,"OrangeburgSC","Orangeburg","SC",45,75,3,"A","Mixed-Humid"]
[null,"PickensSC","Pickens","SC",45,77,3,"A","Mixed-Humid"]
[null,"RichlandSC","Richland","SC",45,79,3,"A","Mixed-Humid"]
[null,"SaludaSC","Saluda","SC",45,81,3,"A","Mixed-Humid"]
[null,"SpartanburgSC","Spartanburg","SC",45,83,3,"A","Mixed-Humid"]
[null,"SumterSC","Sumter","SC",45,85,3,"A","Mixed-Humid"]
[null,"UnionSC","Union","SC",45,87,3,"A","Mixed-Humid"]
[null,"WilliamsburgSC","Williamsburg","SC",45,89,3,"A","Mixed-Humid"]
[null,"YorkSC","York","SC",45,91,3,"A","Mixed-Humid"]
[null,"AuroraSD","Aurora","SD",46,3,6,"A","Cold"]
[null,"BeadleSD","Beadle","SD",46,5,6,"A","Cold"]
[null,"BennettSD","Bennett","SD",46,7,5,"A","Cold"]
[null,"Bon HommeSD","Bon Homme","SD",46,9,5,"A","Cold"]
[null,"BrookingsSD","Brookings","SD",46,11,6,"A","Cold"]
[null,"BrownSD","Brown","SD",46,13,6,"A","Cold"]
[null,"BruleSD","Brule","SD",46,15,6,"A","Cold"]
[null,"BuffaloSD","Buffalo","SD",46,17,6,"A","Cold"]
[null,"ButteSD","Butte","SD",46,19,6,"A","Cold"]
[null,"CampbellSD","Campbell","SD",46,21,6,"A","Cold"]
[null,"Charles MixSD","Charles Mix","SD",46,23,5,"A","Cold"]
[null,"ClarkSD","Clark","SD",46,25,6,"A","Cold"]
[null,"ClaySD","Clay","SD",46,27,5,"A","Cold"]
[null,"CodingtonSD","Codington","SD",46,29,6,"A","Cold"]
[null,"CorsonSD","Corson","SD",46,31,6,"A","Cold"]
[null,"CusterSD","Custer","SD",46,33,6,"A","Cold"]
[null,"DavisonSD","Davison","SD",46,35,6,"A","Cold"]
[null,"DaySD","Day","SD",46,37,6,"A","Cold"]
[null,"DeuelSD","Deuel","SD",46,39,6,"A","Cold"]
[null,"DeweySD","Dewey","SD",46,41,6,"A","Cold"]
[null,"DouglasSD","Douglas","SD",46,43,5,"A","Cold"]
[null,"EdmundsSD","Edmunds","SD",46,45,6,"A","Cold"]
[null,"Fall RiverSD","Fall River","SD",46,47,6,"A","Cold"]
[null,"FaulkSD","Faulk","SD",46,49,6,"A","Cold"]
[null,"GrantSD","Grant","SD",46,51,6,"A","Cold"]
[null,"GregorySD","Gregory","SD",46,53,5,"A","Cold"]
[null,"HaakonSD","Haakon","SD",46,55,6,"A","Cold"]
[null,"HamlinSD","Hamlin","SD",46,57,6,"A","Cold"]
[null,"HandSD","Hand","SD",46,59,6,"A","Cold"]
[null,"HansonSD","Hanson","SD",46,61,6,"A","Cold"]
[null,"HardingSD","Harding","SD",46,63,6,"A","Cold"]
[null,"HughesSD","Hughes","SD",46,65,6,"A","Cold"]
[null,"HutchinsonSD","Hutchinson","SD",46,67,5,"A","Cold"]
[null,"HydeSD","Hyde","SD",46,69,6,"A","Cold"]
[null,"JacksonSD","Jackson","SD",46,71,5,"A","Cold"]
[null,"JerauldSD","Jerauld","SD",46,73,6,"A","Cold"]
[null,"JonesSD","Jones","SD",46,75,6,"A","Cold"]
[null,"KingsburySD","Kingsbury","SD",46,77,6,"A","Cold"]
[null,"LakeSD","Lake","SD",46,79,6,"A","Cold"]
[null,"LawrenceSD","Lawrence","SD",46,81,6,"A","Cold"]
[null,"LincolnSD","Lincoln","SD",46,83,6,"A","Cold"]
[null,"LymanSD","Lyman","SD",46,85,6,"A","Cold"]
[null,"MarshallSD","Marshall","SD",46,91,6,"A","Cold"]
[null,"McCookSD","McCook","SD",46,87,6,"A","Cold"]
[null,"McPhersonSD","McPherson","SD",46,89,6,"A","Cold"]
[null,"MeadeSD","Meade","SD",46,93,6,"A","Cold"]
[null,"MelletteSD","Mellette","SD",46,95,5,"A","Cold"]
[null,{"$f":"CONCATENATE(C2500,D2500)","v":"MinerSD"},"Miner","SD",46,97,6,"A","Cold"]
[null,"MinnehahaSD","Minnehaha","SD",46,99,6,"A","Cold"]
[null,"MoodySD","Moody","SD",46,101,6,"A","Cold"]
[null,"Oglala LakotaSD","Oglala Lakota","SD",46,102,6,"A","Cold"]
[null,"PenningtonSD","Pennington","SD",46,103,6,"A","Cold"]
[null,"PerkinsSD","Perkins","SD",46,105,6,"A","Cold"]
[null,"PotterSD","Potter","SD",46,107,6,"A","Cold"]
[null,"RobertsSD","Roberts","SD",46,109,6,"A","Cold"]
[null,"SanbornSD","Sanborn","SD",46,111,6,"A","Cold"]
[null,"SpinkSD","Spink","SD",46,115,6,"A","Cold"]
[null,"StanleySD","Stanley","SD",46,117,6,"A","Cold"]
[null,"SullySD","Sully","SD",46,119,6,"A","Cold"]
[null,"ToddSD","Todd","SD",46,121,5,"A","Cold"]
[null,"TrippSD","Tripp","SD",46,123,5,"A","Cold"]
[null,"TurnerSD","Turner","SD",46,125,6,"A","Cold"]
[null,"UnionSD","Union","SD",46,127,5,"A","Cold"]
[null,"WalworthSD","Walworth","SD",46,129,6,"A","Cold"]
[null,"YanktonSD","Yankton","SD",46,135,5,"A","Cold"]
[null,"ZiebachSD","Ziebach","SD",46,137,6,"A","Cold"]
[null,"AndersonTN","Anderson","TN",47,1,4,"A","Mixed-Humid"]
[null,"BedfordTN","Bedford","TN",47,3,4,"A","Mixed-Humid"]
[null,"BentonTN","Benton","TN",47,5,4,"A","Mixed-Humid"]
[null,"BledsoeTN","Bledsoe","TN",47,7,4,"A","Mixed-Humid"]
[null,"BlountTN","Blount","TN",47,9,4,"A","Mixed-Humid"]
[null,"BradleyTN","Bradley","TN",47,11,4,"A","Mixed-Humid"]
[null,"CampbellTN","Campbell","TN",47,13,4,"A","Mixed-Humid"]
[null,"CannonTN","Cannon","TN",47,15,4,"A","Mixed-Humid"]
[null,"CarrollTN","Carroll","TN",47,17,4,"A","Mixed-Humid"]
[null,"CarterTN","Carter","TN",47,19,4,"A","Mixed-Humid"]
[null,"CheathamTN","Cheatham","TN",47,21,4,"A","Mixed-Humid"]
[null,"ChesterTN","Chester","TN",47,23,3,"A","Mixed-Humid"]
[null,"ClaiborneTN","Claiborne","TN",47,25,4,"A","Mixed-Humid"]
[null,"ClayTN","Clay","TN",47,27,4,"A","Mixed-Humid"]
[null,"CockeTN","Cocke","TN",47,29,4,"A","Mixed-Humid"]
[null,"CoffeeTN","Coffee","TN",47,31,4,"A","Mixed-Humid"]
[null,"CrockettTN","Crockett","TN",47,33,3,"A","Mixed-Humid"]
[null,"CumberlandTN","Cumberland","TN",47,35,4,"A","Mixed-Humid"]
[null,"DavidsonTN","Davidson","TN",47,37,4,"A","Mixed-Humid"]
[null,"DecaturTN","Decatur","TN",47,39,4,"A","Mixed-Humid"]
[null,"DeKalbTN","DeKalb","TN",47,41,4,"A","Mixed-Humid"]
[null,"DicksonTN","Dickson","TN",47,43,4,"A","Mixed-Humid"]
[null,"DyerTN","Dyer","TN",47,45,3,"A","Mixed-Humid"]
[null,"FayetteTN","Fayette","TN",47,47,3,"A","Mixed-Humid"]
[null,"FentressTN","Fentress","TN",47,49,4,"A","Mixed-Humid"]
[null,"FranklinTN","Franklin","TN",47,51,4,"A","Mixed-Humid"]
[null,"GibsonTN","Gibson","TN",47,53,4,"A","Mixed-Humid"]
[null,"GilesTN","Giles","TN",47,55,4,"A","Mixed-Humid"]
[null,"GraingerTN","Grainger","TN",47,57,4,"A","Mixed-Humid"]
[null,"GreeneTN","Greene","TN",47,59,4,"A","Mixed-Humid"]
[null,"GrundyTN","Grundy","TN",47,61,4,"A","Mixed-Humid"]
[null,"HamblenTN","Hamblen","TN",47,63,4,"A","Mixed-Humid"]
[null,"HamiltonTN","Hamilton","TN",47,65,4,"A","Mixed-Humid"]
[null,"HancockTN","Hancock","TN",47,67,4,"A","Mixed-Humid"]
[null,"HardemanTN","Hardeman","TN",47,69,3,"A","Mixed-Humid"]
[null,"HardinTN","Hardin","TN",47,71,3,"A","Mixed-Humid"]
[null,"HawkinsTN","Hawkins","TN",47,73,4,"A","Mixed-Humid"]
[null,"HaywoodTN","Haywood","TN",47,75,3,"A","Mixed-Humid"]
[null,"HendersonTN","Henderson","TN",47,77,3,"A","Mixed-Humid"]
[null,"HenryTN","Henry","TN",47,79,4,"A","Mixed-Humid"]
[null,"HickmanTN","Hickman","TN",47,81,4,"A","Mixed-Humid"]
[null,"HoustonTN","Houston","TN",47,83,4,"A","Mixed-Humid"]
[null,"HumphreysTN","Humphreys","TN",47,85,4,"A","Mixed-Humid"]
[null,"JacksonTN","Jackson","TN",47,87,4,"A","Mixed-Humid"]
[null,"JeffersonTN","Jefferson","TN",47,89,4,"A","Mixed-Humid"]
[null,{"$f":"CONCATENATE(C2564,D2564)","v":"JohnsonTN"},"Johnson","TN",47,91,4,"A","Mixed-Humid"]
[null,"KnoxTN","Knox","TN",47,93,4,"A","Mixed-Humid"]
[null,"LakeTN","Lake","TN",47,95,3,"A","Mixed-Humid"]
[null,"LauderdaleTN","Lauderdale","TN",47,97,3,"A","Mixed-Humid"]
[null,"LawrenceTN","Lawrence","TN",47,99,4,"A","Mixed-Humid"]
[null,"LewisTN","Lewis","TN",47,101,4,"A","Mixed-Humid"]
[null,"LincolnTN","Lincoln","TN",47,103,4,"A","Mixed-Humid"]
[null,"LoudonTN","Loudon","TN",47,105,4,"A","Mixed-Humid"]
[null,"MaconTN","Macon","TN",47,111,4,"A","Mixed-Humid"]
[null,"MadisonTN","Madison","TN",47,113,3,"A","Mixed-Humid"]
[null,"MarionTN","Marion","TN",47,115,4,"A","Mixed-Humid"]
[null,"MarshallTN","Marshall","TN",47,117,4,"A","Mixed-Humid"]
[null,"MauryTN","Maury","TN",47,119,4,"A","Mixed-Humid"]
[null,"McMinnTN","McMinn","TN",47,107,4,"A","Mixed-Humid"]
[null,"McNairyTN","McNairy","TN",47,109,3,"A","Mixed-Humid"]
[null,"MeigsTN","Meigs","TN",47,121,4,"A","Mixed-Humid"]
[null,"MonroeTN","Monroe","TN",47,123,4,"A","Mixed-Humid"]
[null,"MontgomeryTN","Montgomery","TN",47,125,4,"A","Mixed-Humid"]
[null,"MooreTN","Moore","TN",47,127,4,"A","Mixed-Humid"]
[null,"MorganTN","Morgan","TN",47,129,4,"A","Mixed-Humid"]
[null,"ObionTN","Obion","TN",47,131,4,"A","Mixed-Humid"]
[null,"OvertonTN","Overton","TN",47,133,4,"A","Mixed-Humid"]
[null,"PerryTN","Perry","TN",47,135,4,"A","Mixed-Humid"]
[null,"PickettTN","Pickett","TN",47,137,4,"A","Mixed-Humid"]
[null,"PolkTN","Polk","TN",47,139,4,"A","Mixed-Humid"]
[null,"PutnamTN","Putnam","TN",47,141,4,"A","Mixed-Humid"]
[null,"RheaTN","Rhea","TN",47,143,4,"A","Mixed-Humid"]
[null,"RoaneTN","Roane","TN",47,145,4,"A","Mixed-Humid"]
[null,"RobertsonTN","Robertson","TN",47,147,4,"A","Mixed-Humid"]
[null,"RutherfordTN","Rutherford","TN",47,149,4,"A","Mixed-Humid"]
[null,"ScottTN","Scott","TN",47,151,4,"A","Mixed-Humid"]
[null,"SequatchieTN","Sequatchie","TN",47,153,4,"A","Mixed-Humid"]
[null,"SevierTN","Sevier","TN",47,155,4,"A","Mixed-Humid"]
[null,"ShelbyTN","Shelby","TN",47,157,3,"A","Mixed-Humid"]
[null,"SmithTN","Smith","TN",47,159,4,"A","Mixed-Humid"]
[null,"StewartTN","Stewart","TN",47,161,4,"A","Mixed-Humid"]
[null,"SullivanTN","Sullivan","TN",47,163,4,"A","Mixed-Humid"]
[null,"SumnerTN","Sumner","TN",47,165,4,"A","Mixed-Humid"]
[null,"TiptonTN","Tipton","TN",47,167,3,"A","Mixed-Humid"]
[null,"TrousdaleTN","Trousdale","TN",47,169,4,"A","Mixed-Humid"]
[null,"UnicoiTN","Unicoi","TN",47,171,4,"A","Mixed-Humid"]
[null,"UnionTN","Union","TN",47,173,4,"A","Mixed-Humid"]
[null,"Van BurenTN","Van Buren","TN",47,175,4,"A","Mixed-Humid"]
[null,"WarrenTN","Warren","TN",47,177,4,"A","Mixed-Humid"]
[null,"WashingtonTN","Washington","TN",47,179,4,"A","Mixed-Humid"]
[null,"WayneTN","Wayne","TN",47,181,4,"A","Mixed-Humid"]
[null,"WeakleyTN","Weakley","TN",47,183,4,"A","Mixed-Humid"]
[null,"WhiteTN","White","TN",47,185,4,"A","Mixed-Humid"]
[null,"WilliamsonTN","Williamson","TN",47,187,4,"A","Mixed-Humid"]
[null,"WilsonTN","Wilson","TN",47,189,4,"A","Mixed-Humid"]
[null,"AndersonTX","Anderson","TX",48,1,2,"A","Hot-Humid"]
[null,"AndrewsTX","Andrews","TX",48,3,3,"B","Hot-Dry"]
[null,"AngelinaTX","Angelina","TX",48,5,2,"A","Hot-Humid"]
[null,"AransasTX","Aransas","TX",48,7,2,"A","Hot-Humid"]
[null,"ArcherTX","Archer","TX",48,9,3,"A","Mixed-Humid"]
[null,"ArmstrongTX","Armstrong","TX",48,11,4,"B","Mixed-Dry"]
[null,"AtascosaTX","Atascosa","TX",48,13,2,"A","Hot-Humid"]
[null,"AustinTX","Austin","TX",48,15,2,"A","Hot-Humid"]
[null,"BaileyTX","Bailey","TX",48,17,4,"B","Mixed-Dry"]
[null,"BanderaTX","Bandera","TX",48,19,2,"B","Hot-Humid"]
[null,"BastropTX","Bastrop","TX",48,21,2,"A","Hot-Humid"]
[null,"BaylorTX","Baylor","TX",48,23,3,"B","Hot-Dry"]
[null,"BeeTX","Bee","TX",48,25,2,"A","Hot-Humid"]
[null,"BellTX","Bell","TX",48,27,2,"A","Hot-Humid"]
[null,{"$f":"CONCATENATE(C2628,D2628)","v":"BexarTX"},"Bexar","TX",48,29,2,"A","Hot-Humid"]
[null,"BlancoTX","Blanco","TX",48,31,3,"A","Hot-Humid"]
[null,"BordenTX","Borden","TX",48,33,3,"B","Hot-Dry"]
[null,"BosqueTX","Bosque","TX",48,35,2,"A","Hot-Humid"]
[null,"BowieTX","Bowie","TX",48,37,3,"A","Hot-Humid"]
[null,"BrazoriaTX","Brazoria","TX",48,39,2,"A","Hot-Humid"]
[null,"BrazosTX","Brazos","TX",48,41,2,"A","Hot-Humid"]
[null,"BrewsterTX","Brewster","TX",48,43,3,"B","Hot-Dry"]
[null,"BriscoeTX","Briscoe","TX",48,45,4,"B","Mixed-Dry"]
[null,"BrooksTX","Brooks","TX",48,47,2,"A","Hot-Humid"]
[null,"BrownTX","Brown","TX",48,49,3,"A","Hot-Humid"]
[null,"BurlesonTX","Burleson","TX",48,51,2,"A","Hot-Humid"]
[null,"BurnetTX","Burnet","TX",48,53,3,"A","Hot-Humid"]
[null,"CaldwellTX","Caldwell","TX",48,55,2,"A","Hot-Humid"]
[null,"CalhounTX","Calhoun","TX",48,57,2,"A","Hot-Humid"]
[null,"CallahanTX","Callahan","TX",48,59,3,"B","Hot-Dry"]
[null,"CameronTX","Cameron","TX",48,61,2,"A","Hot-Humid"]
[null,"CampTX","Camp","TX",48,63,3,"A","Hot-Humid"]
[null,"CarsonTX","Carson","TX",48,65,4,"B","Mixed-Dry"]
[null,"CassTX","Cass","TX",48,67,3,"A","Hot-Humid"]
[null,"CastroTX","Castro","TX",48,69,4,"B","Mixed-Dry"]
[null,"ChambersTX","Chambers","TX",48,71,2,"A","Hot-Humid"]
[null,"CherokeeTX","Cherokee","TX",48,73,2,"A","Hot-Humid"]
[null,"ChildressTX","Childress","TX",48,75,3,"B","Hot-Dry"]
[null,"ClayTX","Clay","TX",48,77,3,"A","Mixed-Humid"]
[null,"CochranTX","Cochran","TX",48,79,4,"B","Mixed-Dry"]
[null,"CokeTX","Coke","TX",48,81,3,"B","Hot-Dry"]
[null,"ColemanTX","Coleman","TX",48,83,3,"B","Hot-Dry"]
[null,"CollinTX","Collin","TX",48,85,3,"A","Hot-Humid"]
[null,"CollingsworthTX","Collingsworth","TX",48,87,3,"B","Hot-Dry"]
[null,"ColoradoTX","Colorado","TX",48,89,2,"A","Hot-Humid"]
[null,"ComalTX","Comal","TX",48,91,2,"A","Hot-Humid"]
[null,"ComancheTX","Comanche","TX",48,93,3,"A","Hot-Humid"]
[null,"ConchoTX","Concho","TX",48,95,3,"B","Hot-Dry"]
[null,"CookeTX","Cooke","TX",48,97,3,"A","Mixed-Humid"]
[null,"CoryellTX","Coryell","TX",48,99,2,"A","Hot-Humid"]
[null,"CottleTX","Cottle","TX",48,101,3,"B","Hot-Dry"]
[null,"CraneTX","Crane","TX",48,103,3,"B","Hot-Dry"]
[null,"CrockettTX","Crockett","TX",48,105,3,"B","Hot-Dry"]
[null,"CrosbyTX","Crosby","TX",48,107,3,"B","Hot-Dry"]
[null,"CulbersonTX","Culberson","TX",48,109,3,"B","Hot-Dry"]
[null,"DallamTX","Dallam","TX",48,111,4,"B","Mixed-Dry"]
[null,"DallasTX","Dallas","TX",48,113,3,"A","Hot-Humid"]
[null,"DawsonTX","Dawson","TX",48,115,3,"B","Hot-Dry"]
[null,"Deaf SmithTX","Deaf Smith","TX",48,117,4,"B","Mixed-Dry"]
[null,"DeltaTX","Delta","TX",48,119,3,"A","Hot-Humid"]
[null,"DentonTX","Denton","TX",48,121,3,"A","Hot-Humid"]
[null,"DeWittTX","DeWitt","TX",48,123,2,"A","Hot-Humid"]
[null,"DickensTX","Dickens","TX",48,125,3,"B","Hot-Dry"]
[null,"DimmitTX","Dimmit","TX",48,127,2,"B","Hot-Humid"]
[null,"DonleyTX","Donley","TX",48,129,4,"B","Mixed-Dry"]
[null,"DuvalTX","Duval","TX",48,131,2,"A","Hot-Humid"]
[null,"EastlandTX","Eastland","TX",48,133,3,"A","Mixed-Humid"]
[null,"EctorTX","Ector","TX",48,135,3,"B","Hot-Dry"]
[null,"EdwardsTX","Edwards","TX",48,137,2,"B","Hot-Humid"]
[null,"El PasoTX","El Paso","TX",48,141,3,"B","Hot-Dry"]
[null,"EllisTX","Ellis","TX",48,139,3,"A","Hot-Humid"]
[null,"ErathTX","Erath","TX",48,143,3,"A","Hot-Humid"]
[null,"FallsTX","Falls","TX",48,145,2,"A","Hot-Humid"]
[null,"FanninTX","Fannin","TX",48,147,3,"A","Mixed-Humid"]
[null,"FayetteTX","Fayette","TX",48,149,2,"A","Hot-Humid"]
[null,"FisherTX","Fisher","TX",48,151,3,"B","Hot-Dry"]
[null,"FloydTX","Floyd","TX",48,153,4,"B","Mixed-Dry"]
[null,"FoardTX","Foard","TX",48,155,3,"B","Hot-Dry"]
[null,{"$f":"CONCATENATE(C2692,D2692)","v":"Fort BendTX"},"Fort Bend","TX",48,157,2,"A","Hot-Humid"]
[null,"FranklinTX","Franklin","TX",48,159,3,"A","Hot-Humid"]
[null,"FreestoneTX","Freestone","TX",48,161,2,"A","Hot-Humid"]
[null,"FrioTX","Frio","TX",48,163,2,"B","Hot-Humid"]
[null,"GainesTX","Gaines","TX",48,165,3,"B","Hot-Dry"]
[null,"GalvestonTX","Galveston","TX",48,167,2,"A","Hot-Humid"]
[null,"GarzaTX","Garza","TX",48,169,3,"B","Hot-Dry"]
[null,"GillespieTX","Gillespie","TX",48,171,3,"A","Hot-Humid"]
[null,"GlasscockTX","Glasscock","TX",48,173,3,"B","Hot-Dry"]
[null,"GoliadTX","Goliad","TX",48,175,2,"A","Hot-Humid"]
[null,"GonzalesTX","Gonzales","TX",48,177,2,"A","Hot-Humid"]
[null,"GrayTX","Gray","TX",48,179,4,"B","Mixed-Dry"]
[null,"GraysonTX","Grayson","TX",48,181,3,"A","Mixed-Humid"]
[null,"GreggTX","Gregg","TX",48,183,3,"A","Hot-Humid"]
[null,"GrimesTX","Grimes","TX",48,185,2,"A","Hot-Humid"]
[null,"GuadalupeTX","Guadalupe","TX",48,187,2,"A","Hot-Humid"]
[null,"HaleTX","Hale","TX",48,189,4,"B","Mixed-Dry"]
[null,"HallTX","Hall","TX",48,191,3,"B","Hot-Dry"]
[null,"HamiltonTX","Hamilton","TX",48,193,3,"A","Hot-Humid"]
[null,"HansfordTX","Hansford","TX",48,195,4,"B","Mixed-Dry"]
[null,"HardemanTX","Hardeman","TX",48,197,3,"B","Hot-Dry"]
[null,"HardinTX","Hardin","TX",48,199,2,"A","Hot-Humid"]
[null,"HarrisTX","Harris","TX",48,201,2,"A","Hot-Humid"]
[null,"HarrisonTX","Harrison","TX",48,203,3,"A","Hot-Humid"]
[null,"HartleyTX","Hartley","TX",48,205,4,"B","Mixed-Dry"]
[null,"HaskellTX","Haskell","TX",48,207,3,"B","Hot-Dry"]
[null,"HaysTX","Hays","TX",48,209,2,"A","Hot-Humid"]
[null,"HemphillTX","Hemphill","TX",48,211,3,"B","Hot-Dry"]
[null,"HendersonTX","Henderson","TX",48,213,3,"A","Hot-Humid"]
[null,"HidalgoTX","Hidalgo","TX",48,215,2,"A","Hot-Humid"]
[null,"HillTX","Hill","TX",48,217,2,"A","Hot-Humid"]
[null,"HockleyTX","Hockley","TX",48,219,4,"B","Mixed-Dry"]
[null,"HoodTX","Hood","TX",48,221,3,"A","Hot-Humid"]
[null,"HopkinsTX","Hopkins","TX",48,223,3,"A","Hot-Humid"]
[null,"HoustonTX","Houston","TX",48,225,2,"A","Hot-Humid"]
[null,"HowardTX","Howard","TX",48,227,3,"B","Hot-Dry"]
[null,"HudspethTX","Hudspeth","TX",48,229,3,"B","Hot-Dry"]
[null,"HuntTX","Hunt","TX",48,231,3,"A","Hot-Humid"]
[null,"HutchinsonTX","Hutchinson","TX",48,233,4,"B","Mixed-Dry"]
[null,"IrionTX","Irion","TX",48,235,3,"B","Hot-Dry"]
[null,"JackTX","Jack","TX",48,237,3,"A","Mixed-Humid"]
[null,"JacksonTX","Jackson","TX",48,239,2,"A","Hot-Humid"]
[null,"JasperTX","Jasper","TX",48,241,2,"A","Hot-Humid"]
[null,"Jeff DavisTX","Jeff Davis","TX",48,243,3,"B","Hot-Dry"]
[null,"JeffersonTX","Jefferson","TX",48,245,2,"A","Hot-Humid"]
[null,"Jim HoggTX","Jim Hogg","TX",48,247,2,"A","Hot-Humid"]
[null,"Jim WellsTX","Jim Wells","TX",48,249,2,"A","Hot-Humid"]
[null,"JohnsonTX","Johnson","TX",48,251,3,"A","Hot-Humid"]
[null,"JonesTX","Jones","TX",48,253,3,"B","Hot-Dry"]
[null,"KarnesTX","Karnes","TX",48,255,2,"A","Hot-Humid"]
[null,"KaufmanTX","Kaufman","TX",48,257,3,"A","Hot-Humid"]
[null,"KendallTX","Kendall","TX",48,259,3,"A","Hot-Humid"]
[null,"KenedyTX","Kenedy","TX",48,261,2,"A","Hot-Humid"]
[null,"KentTX","Kent","TX",48,263,3,"B","Hot-Dry"]
[null,"KerrTX","Kerr","TX",48,265,3,"B","Hot-Dry"]
[null,"KimbleTX","Kimble","TX",48,267,3,"B","Hot-Dry"]
[null,"KingTX","King","TX",48,269,3,"B","Hot-Dry"]
[null,"KinneyTX","Kinney","TX",48,271,2,"B","Hot-Humid"]
[null,"KlebergTX","Kleberg","TX",48,273,2,"A","Hot-Humid"]
[null,"KnoxTX","Knox","TX",48,275,3,"B","Hot-Dry"]
[null,"La SalleTX","La Salle","TX",48,283,2,"B","Hot-Humid"]
[null,"LamarTX","Lamar","TX",48,277,3,"A","Hot-Humid"]
[null,"LambTX","Lamb","TX",48,279,4,"B","Mixed-Dry"]
[null,"LampasasTX","Lampasas","TX",48,281,3,"A","Hot-Humid"]
[null,{"$f":"CONCATENATE(C2756,D2756)","v":"LavacaTX"},"Lavaca","TX",48,285,2,"A","Hot-Humid"]
[null,"LeeTX","Lee","TX",48,287,2,"A","Hot-Humid"]
[null,"LeonTX","Leon","TX",48,289,2,"A","Hot-Humid"]
[null,"LibertyTX","Liberty","TX",48,291,2,"A","Hot-Humid"]
[null,"LimestoneTX","Limestone","TX",48,293,2,"A","Hot-Humid"]
[null,"LipscombTX","Lipscomb","TX",48,295,4,"B","Mixed-Dry"]
[null,"Live OakTX","Live Oak","TX",48,297,2,"A","Hot-Humid"]
[null,"LlanoTX","Llano","TX",48,299,3,"A","Hot-Humid"]
[null,"LovingTX","Loving","TX",48,301,3,"B","Hot-Dry"]
[null,"LubbockTX","Lubbock","TX",48,303,3,"B","Hot-Dry"]
[null,"LynnTX","Lynn","TX",48,305,3,"B","Hot-Dry"]
[null,"McCullochTX","McCulloch","TX",48,307,3,"B","Hot-Dry"]
[null,"McLennanTX","McLennan","TX",48,309,2,"A","Hot-Humid"]
[null,"McMullenTX","McMullen","TX",48,311,2,"A","Hot-Humid"]
[null,"MadisonTX","Madison","TX",48,313,2,"A","Hot-Humid"]
[null,"MarionTX","Marion","TX",48,315,3,"A","Hot-Humid"]
[null,"MartinTX","Martin","TX",48,317,3,"B","Hot-Dry"]
[null,"MasonTX","Mason","TX",48,319,3,"B","Hot-Dry"]
[null,"MatagordaTX","Matagorda","TX",48,321,2,"A","Hot-Humid"]
[null,"MaverickTX","Maverick","TX",48,323,2,"B","Hot-Humid"]
[null,"MedinaTX","Medina","TX",48,325,2,"B","Hot-Humid"]
[null,"MenardTX","Menard","TX",48,327,3,"B","Hot-Dry"]
[null,"MidlandTX","Midland","TX",48,329,3,"B","Hot-Dry"]
[null,"MilamTX","Milam","TX",48,331,2,"A","Hot-Humid"]
[null,"MillsTX","Mills","TX",48,333,3,"A","Hot-Humid"]
[null,"MitchellTX","Mitchell","TX",48,335,3,"B","Hot-Dry"]
[null,"MontagueTX","Montague","TX",48,337,3,"A","Mixed-Humid"]
[null,"MontgomeryTX","Montgomery","TX",48,339,2,"A","Hot-Humid"]
[null,"MooreTX","Moore","TX",48,341,4,"B","Mixed-Dry"]
[null,"MorrisTX","Morris","TX",48,343,3,"A","Hot-Humid"]
[null,"MotleyTX","Motley","TX",48,345,3,"B","Hot-Dry"]
[null,"NacogdochesTX","Nacogdoches","TX",48,347,3,"A","Hot-Humid"]
[null,"NavarroTX","Navarro","TX",48,349,3,"A","Hot-Humid"]
[null,"NewtonTX","Newton","TX",48,351,2,"A","Hot-Humid"]
[null,"NolanTX","Nolan","TX",48,353,3,"B","Hot-Dry"]
[null,"NuecesTX","Nueces","TX",48,355,2,"A","Hot-Humid"]
[null,"OchiltreeTX","Ochiltree","TX",48,357,4,"B","Mixed-Dry"]
[null,"OldhamTX","Oldham","TX",48,359,4,"B","Mixed-Dry"]
[null,"OrangeTX","Orange","TX",48,361,2,"A","Hot-Humid"]
[null,"Palo PintoTX","Palo Pinto","TX",48,363,3,"A","Mixed-Humid"]
[null,"PanolaTX","Panola","TX",48,365,3,"A","Hot-Humid"]
[null,"ParkerTX","Parker","TX",48,367,3,"A","Hot-Humid"]
[null,"ParmerTX","Parmer","TX",48,369,4,"B","Mixed-Dry"]
[null,"PecosTX","Pecos","TX",48,371,3,"B","Hot-Dry"]
[null,"PolkTX","Polk","TX",48,373,2,"A","Hot-Humid"]
[null,"PotterTX","Potter","TX",48,375,4,"B","Mixed-Dry"]
[null,"PresidioTX","Presidio","TX",48,377,3,"B","Hot-Dry"]
[null,"RainsTX","Rains","TX",48,379,3,"A","Hot-Humid"]
[null,"RandallTX","Randall","TX",48,381,4,"B","Mixed-Dry"]
[null,"ReaganTX","Reagan","TX",48,383,3,"B","Hot-Dry"]
[null,"RealTX","Real","TX",48,385,2,"B","Hot-Humid"]
[null,"Red RiverTX","Red River","TX",48,387,3,"A","Hot-Humid"]
[null,"ReevesTX","Reeves","TX",48,389,3,"B","Hot-Dry"]
[null,"RefugioTX","Refugio","TX",48,391,2,"A","Hot-Humid"]
[null,"RobertsTX","Roberts","TX",48,393,4,"B","Mixed-Dry"]
[null,"RobertsonTX","Robertson","TX",48,395,2,"A","Hot-Humid"]
[null,"RockwallTX","Rockwall","TX",48,397,3,"A","Hot-Humid"]
[null,"RunnelsTX","Runnels","TX",48,399,3,"B","Hot-Dry"]
[null,"RuskTX","Rusk","TX",48,401,3,"A","Hot-Humid"]
[null,"SabineTX","Sabine","TX",48,403,3,"A","Hot-Humid"]
[null,"San AugustineTX","San Augustine","TX",48,405,3,"A","Hot-Humid"]
[null,"San JacintoTX","San Jacinto","TX",48,407,2,"A","Hot-Humid"]
[null,"San PatricioTX","San Patricio","TX",48,409,2,"A","Hot-Humid"]
[null,"San SabaTX","San Saba","TX",48,411,3,"A","Hot-Humid"]
[null,{"$f":"CONCATENATE(C2820,D2820)","v":"SchleicherTX"},"Schleicher","TX",48,413,3,"B","Hot-Dry"]
[null,"ScurryTX","Scurry","TX",48,415,3,"B","Hot-Dry"]
[null,"ShackelfordTX","Shackelford","TX",48,417,3,"B","Hot-Dry"]
[null,"ShelbyTX","Shelby","TX",48,419,3,"A","Hot-Humid"]
[null,"ShermanTX","Sherman","TX",48,421,4,"B","Mixed-Dry"]
[null,"SmithTX","Smith","TX",48,423,3,"A","Hot-Humid"]
[null,"SomervellTX","Somervell","TX",48,425,3,"A","Hot-Humid"]
[null,"StarrTX","Starr","TX",48,427,2,"A","Hot-Humid"]
[null,"StephensTX","Stephens","TX",48,429,3,"A","Mixed-Humid"]
[null,"SterlingTX","Sterling","TX",48,431,3,"B","Hot-Dry"]
[null,"StonewallTX","Stonewall","TX",48,433,3,"B","Hot-Dry"]
[null,"SuttonTX","Sutton","TX",48,435,3,"B","Hot-Dry"]
[null,"SwisherTX","Swisher","TX",48,437,4,"B","Mixed-Dry"]
[null,"TarrantTX","Tarrant","TX",48,439,3,"A","Hot-Humid"]
[null,"TaylorTX","Taylor","TX",48,441,3,"B","Hot-Dry"]
[null,"TerrellTX","Terrell","TX",48,443,3,"B","Hot-Dry"]
[null,"TerryTX","Terry","TX",48,445,3,"B","Hot-Dry"]
[null,"ThrockmortonTX","Throckmorton","TX",48,447,3,"B","Hot-Dry"]
[null,"TitusTX","Titus","TX",48,449,3,"A","Hot-Humid"]
[null,"Tom GreenTX","Tom Green","TX",48,451,3,"B","Hot-Dry"]
[null,"TravisTX","Travis","TX",48,453,2,"A","Hot-Humid"]
[null,"TrinityTX","Trinity","TX",48,455,2,"A","Hot-Humid"]
[null,"TylerTX","Tyler","TX",48,457,2,"A","Hot-Humid"]
[null,"UpshurTX","Upshur","TX",48,459,3,"A","Hot-Humid"]
[null,"UptonTX","Upton","TX",48,461,3,"B","Hot-Dry"]
[null,"UvaldeTX","Uvalde","TX",48,463,2,"B","Hot-Humid"]
[null,"Val VerdeTX","Val Verde","TX",48,465,2,"B","Hot-Humid"]
[null,"Van ZandtTX","Van Zandt","TX",48,467,3,"A","Hot-Humid"]
[null,"VictoriaTX","Victoria","TX",48,469,2,"A","Hot-Humid"]
[null,"WalkerTX","Walker","TX",48,471,2,"A","Hot-Humid"]
[null,"WallerTX","Waller","TX",48,473,2,"A","Hot-Humid"]
[null,"WardTX","Ward","TX",48,475,3,"B","Hot-Dry"]
[null,"WashingtonTX","Washington","TX",48,477,2,"A","Hot-Humid"]
[null,"WebbTX","Webb","TX",48,479,2,"B","Hot-Humid"]
[null,"WhartonTX","Wharton","TX",48,481,2,"A","Hot-Humid"]
[null,"WheelerTX","Wheeler","TX",48,483,3,"B","Hot-Dry"]
[null,"WichitaTX","Wichita","TX",48,485,3,"A","Mixed-Humid"]
[null,"WilbargerTX","Wilbarger","TX",48,487,3,"B","Hot-Dry"]
[null,"WillacyTX","Willacy","TX",48,489,2,"A","Hot-Humid"]
[null,"WilliamsonTX","Williamson","TX",48,491,2,"A","Hot-Humid"]
[null,"WilsonTX","Wilson","TX",48,493,2,"A","Hot-Humid"]
[null,"WinklerTX","Winkler","TX",48,495,3,"B","Hot-Dry"]
[null,"WiseTX","Wise","TX",48,497,3,"A","Mixed-Humid"]
[null,"WoodTX","Wood","TX",48,499,3,"A","Hot-Humid"]
[null,"YoakumTX","Yoakum","TX",48,501,4,"B","Mixed-Dry"]
[null,"YoungTX","Young","TX",48,503,3,"A","Mixed-Humid"]
[null,"ZapataTX","Zapata","TX",48,505,2,"B","Hot-Humid"]
[null,"ZavalaTX","Zavala","TX",48,507,2,"B","Hot-Humid"]
[null,"Midway IslandsUM","Midway Islands","UM",74,300,1,"A","Hot-Humid"]
[null,"BeaverUT","Beaver","UT",49,1,5,"B","Cold"]
[null,"Box ElderUT","Box Elder","UT",49,3,6,"B","Cold"]
[null,"CacheUT","Cache","UT",49,5,6,"B","Cold"]
[null,"CarbonUT","Carbon","UT",49,7,6,"B","Cold"]
[null,"DaggettUT","Daggett","UT",49,9,6,"B","Cold"]
[null,"DavisUT","Davis","UT",49,11,5,"B","Cold"]
[null,"DuchesneUT","Duchesne","UT",49,13,6,"B","Cold"]
[null,"EmeryUT","Emery","UT",49,15,5,"B","Cold"]
[null,"GarfieldUT","Garfield","UT",49,17,5,"B","Cold"]
[null,"GrandUT","Grand","UT",49,19,5,"B","Cold"]
[null,"IronUT","Iron","UT",49,21,5,"B","Cold"]
[null,"JuabUT","Juab","UT",49,23,5,"B","Cold"]
[null,"KaneUT","Kane","UT",49,25,5,"B","Cold"]
[null,"MillardUT","Millard","UT",49,27,5,"B","Cold"]
[null,"MorganUT","Morgan","UT",49,29,6,"B","Cold"]
[null,{"$f":"CONCATENATE(C2884,D2884)","v":"PiuteUT"},"Piute","UT",49,31,5,"B","Cold"]
[null,"RichUT","Rich","UT",49,33,6,"B","Cold"]
[null,"Salt LakeUT","Salt Lake","UT",49,35,5,"B","Cold"]
[null,"San JuanUT","San Juan","UT",49,37,5,"B","Cold"]
[null,"SanpeteUT","Sanpete","UT",49,39,5,"B","Cold"]
[null,"SevierUT","Sevier","UT",49,41,5,"B","Cold"]
[null,"SummitUT","Summit","UT",49,43,6,"B","Cold"]
[null,"TooeleUT","Tooele","UT",49,45,5,"B","Cold"]
[null,"UintahUT","Uintah","UT",49,47,6,"B","Cold"]
[null,"UtahUT","Utah","UT",49,49,5,"B","Cold"]
[null,"WasatchUT","Wasatch","UT",49,51,6,"B","Cold"]
[null,"WashingtonUT","Washington","UT",49,53,3,"B","Hot-Dry"]
[null,"WayneUT","Wayne","UT",49,55,5,"B","Cold"]
[null,"WeberUT","Weber","UT",49,57,5,"B","Cold"]
[null,"AccomackVA","Accomack","VA",51,1,4,"A","Mixed-Humid"]
[null,"AlbemarleVA","Albemarle","VA",51,3,4,"A","Mixed-Humid"]
[null,"Alexandria (city)VA","Alexandria (city)","VA",51,510,4,"A","Mixed-Humid"]
[null,"AlleghanyVA","Alleghany","VA",51,5,4,"A","Mixed-Humid"]
[null,"AmeliaVA","Amelia","VA",51,7,4,"A","Mixed-Humid"]
[null,"AmherstVA","Amherst","VA",51,9,4,"A","Mixed-Humid"]
[null,"AppomattoxVA","Appomattox","VA",51,11,4,"A","Mixed-Humid"]
[null,"ArlingtonVA","Arlington","VA",51,13,4,"A","Mixed-Humid"]
[null,"AugustaVA","Augusta","VA",51,15,4,"A","Mixed-Humid"]
[null,"BathVA","Bath","VA",51,17,4,"A","Mixed-Humid"]
[null,"BedfordVA","Bedford","VA",51,19,4,"A","Mixed-Humid"]
[null,"Bedford (city)VA","Bedford (city)","VA",51,515,4,"A","Mixed-Humid"]
[null,"BlandVA","Bland","VA",51,21,4,"A","Mixed-Humid"]
[null,"BotetourtVA","Botetourt","VA",51,23,4,"A","Mixed-Humid"]
[null,"Bristol (city)VA","Bristol (city)","VA",51,520,4,"A","Mixed-Humid"]
[null,"BrunswickVA","Brunswick","VA",51,25,4,"A","Mixed-Humid"]
[null,"BuchananVA","Buchanan","VA",51,27,4,"A","Mixed-Humid"]
[null,"BuckinghamVA","Buckingham","VA",51,29,4,"A","Mixed-Humid"]
[null,"Buena Vista (city)VA","Buena Vista (city)","VA",51,530,4,"A","Mixed-Humid"]
[null,"CampbellVA","Campbell","VA",51,31,4,"A","Mixed-Humid"]
[null,"CarolineVA","Caroline","VA",51,33,4,"A","Mixed-Humid"]
[null,"CarrollVA","Carroll","VA",51,35,4,"A","Mixed-Humid"]
[null,"Charles CityVA","Charles City","VA",51,36,4,"A","Mixed-Humid"]
[null,"CharlotteVA","Charlotte","VA",51,37,4,"A","Mixed-Humid"]
[null,"Charlottesville (city)VA","Charlottesville (city)","VA",51,540,4,"A","Mixed-Humid"]
[null,"Chesapeake (city)VA","Chesapeake (city)","VA",51,550,4,"A","Mixed-Humid"]
[null,"ChesterfieldVA","Chesterfield","VA",51,41,4,"A","Mixed-Humid"]
[null,"ClarkeVA","Clarke","VA",51,43,4,"A","Mixed-Humid"]
[null,"Colonial Heights (city)VA","Colonial Heights (city)","VA",51,570,4,"A","Mixed-Humid"]
[null,"Covington (city)VA","Covington (city)","VA",51,580,4,"A","Mixed-Humid"]
[null,"CraigVA","Craig","VA",51,45,4,"A","Mixed-Humid"]
[null,"CulpeperVA","Culpeper","VA",51,47,4,"A","Mixed-Humid"]
[null,"CumberlandVA","Cumberland","VA",51,49,4,"A","Mixed-Humid"]
[null,"Danville (city)VA","Danville (city)","VA",51,590,4,"A","Mixed-Humid"]
[null,"DickensonVA","Dickenson","VA",51,51,4,"A","Mixed-Humid"]
[null,"DinwiddieVA","Dinwiddie","VA",51,53,4,"A","Mixed-Humid"]
[null,"Emporia (city)VA","Emporia (city)","VA",51,595,4,"A","Mixed-Humid"]
[null,"EssexVA","Essex","VA",51,57,4,"A","Mixed-Humid"]
[null,"FairfaxVA","Fairfax","VA",51,59,4,"A","Mixed-Humid"]
[null,"Fairfax (city)VA","Fairfax (city)","VA",51,600,4,"A","Mixed-Humid"]
[null,"Falls Church (city)VA","Falls Church (city)","VA",51,610,4,"A","Mixed-Humid"]
[null,"FauquierVA","Fauquier","VA",51,61,4,"A","Mixed-Humid"]
[null,"FloydVA","Floyd","VA",51,63,4,"A","Mixed-Humid"]
[null,"FluvannaVA","Fluvanna","VA",51,65,4,"A","Mixed-Humid"]
[null,"FranklinVA","Franklin","VA",51,67,4,"A","Mixed-Humid"]
[null,"Franklin (city)VA","Franklin (city)","VA",51,620,4,"A","Mixed-Humid"]
[null,"FrederickVA","Frederick","VA",51,69,4,"A","Mixed-Humid"]
[null,"Fredericksburg (city)VA","Fredericksburg (city)","VA",51,630,4,"A","Mixed-Humid"]
[null,"Galax (city)VA","Galax (city)","VA",51,640,4,"A","Mixed-Humid"]
[null,"GilesVA","Giles","VA",51,71,4,"A","Mixed-Humid"]
[null,{"$f":"CONCATENATE(C2948,D2948)","v":"GloucesterVA"},"Gloucester","VA",51,73,4,"A","Mixed-Humid"]
[null,"GoochlandVA","Goochland","VA",51,75,4,"A","Mixed-Humid"]
[null,"GraysonVA","Grayson","VA",51,77,4,"A","Mixed-Humid"]
[null,"GreeneVA","Greene","VA",51,79,4,"A","Mixed-Humid"]
[null,"GreensvilleVA","Greensville","VA",51,81,4,"A","Mixed-Humid"]
[null,"HalifaxVA","Halifax","VA",51,83,4,"A","Mixed-Humid"]
[null,"Hampton (city)VA","Hampton (city)","VA",51,650,4,"A","Mixed-Humid"]
[null,"HanoverVA","Hanover","VA",51,85,4,"A","Mixed-Humid"]
[null,"Harrisonburg (city)VA","Harrisonburg (city)","VA",51,660,4,"A","Mixed-Humid"]
[null,"HenricoVA","Henrico","VA",51,87,4,"A","Mixed-Humid"]
[null,"HenryVA","Henry","VA",51,89,4,"A","Mixed-Humid"]
[null,"HighlandVA","Highland","VA",51,91,4,"A","Mixed-Humid"]
[null,"Hopewell (city)VA","Hopewell (city)","VA",51,670,4,"A","Mixed-Humid"]
[null,"Isle of WightVA","Isle of Wight","VA",51,93,4,"A","Mixed-Humid"]
[null,"James CityVA","James City","VA",51,95,4,"A","Mixed-Humid"]
[null,"King and QueenVA","King and Queen","VA",51,97,4,"A","Mixed-Humid"]
[null,"King GeorgeVA","King George","VA",51,99,4,"A","Mixed-Humid"]
[null,"King WilliamVA","King William","VA",51,101,4,"A","Mixed-Humid"]
[null,"LancasterVA","Lancaster","VA",51,103,4,"A","Mixed-Humid"]
[null,"LeeVA","Lee","VA",51,105,4,"A","Mixed-Humid"]
[null,"Lexington (city)VA","Lexington (city)","VA",51,678,4,"A","Mixed-Humid"]
[null,"LoudounVA","Loudoun","VA",51,107,4,"A","Mixed-Humid"]
[null,"LouisaVA","Louisa","VA",51,109,4,"A","Mixed-Humid"]
[null,"LunenburgVA","Lunenburg","VA",51,111,4,"A","Mixed-Humid"]
[null,"Lynchburg (city)VA","Lynchburg (city)","VA",51,680,4,"A","Mixed-Humid"]
[null,"MadisonVA","Madison","VA",51,113,4,"A","Mixed-Humid"]
[null,"ManassasVA","Manassas","VA",51,683,4,"A","Mixed-Humid"]
[null,"Manassas Park (city)VA","Manassas Park (city)","VA",51,685,4,"A","Mixed-Humid"]
[null,"Martinsville (city)VA","Martinsville (city)","VA",51,690,4,"A","Mixed-Humid"]
[null,"MathewsVA","Mathews","VA",51,115,4,"A","Mixed-Humid"]
[null,"MecklenburgVA","Mecklenburg","VA",51,117,4,"A","Mixed-Humid"]
[null,"MiddlesexVA","Middlesex","VA",51,119,4,"A","Mixed-Humid"]
[null,"MontgomeryVA","Montgomery","VA",51,121,4,"A","Mixed-Humid"]
[null,"NelsonVA","Nelson","VA",51,125,4,"A","Mixed-Humid"]
[null,"New KentVA","New Kent","VA",51,127,4,"A","Mixed-Humid"]
[null,"Newport News (city)VA","Newport News (city)","VA",51,700,4,"A","Mixed-Humid"]
[null,"Norfolk (city)VA","Norfolk (city)","VA",51,710,4,"A","Mixed-Humid"]
[null,"NorthamptonVA","Northampton","VA",51,131,4,"A","Mixed-Humid"]
[null,"NorthumberlandVA","Northumberland","VA",51,133,4,"A","Mixed-Humid"]
[null,"Norton (city)VA","Norton (city)","VA",51,720,4,"A","Mixed-Humid"]
[null,"NottowayVA","Nottoway","VA",51,135,4,"A","Mixed-Humid"]
[null,"OrangeVA","Orange","VA",51,137,4,"A","Mixed-Humid"]
[null,"PageVA","Page","VA",51,139,4,"A","Mixed-Humid"]
[null,"PatrickVA","Patrick","VA",51,141,4,"A","Mixed-Humid"]
[null,"Petersburg (city)VA","Petersburg (city)","VA",51,730,4,"A","Mixed-Humid"]
[null,"PittsylvaniaVA","Pittsylvania","VA",51,143,4,"A","Mixed-Humid"]
[null,"Poquoson (city)VA","Poquoson (city)","VA",51,735,4,"A","Mixed-Humid"]
[null,"Portsmouth (city)VA","Portsmouth (city)","VA",51,740,4,"A","Mixed-Humid"]
[null,"PowhatanVA","Powhatan","VA",51,145,4,"A","Mixed-Humid"]
[null,"Prince EdwardVA","Prince Edward","VA",51,147,4,"A","Mixed-Humid"]
[null,"Prince GeorgeVA","Prince George","VA",51,149,4,"A","Mixed-Humid"]
[null,"Prince WilliamVA","Prince William","VA",51,153,4,"A","Mixed-Humid"]
[null,"PulaskiVA","Pulaski","VA",51,155,4,"A","Mixed-Humid"]
[null,"Radford (city)VA","Radford (city)","VA",51,750,4,"A","Mixed-Humid"]
[null,"RappahannockVA","Rappahannock","VA",51,157,4,"A","Mixed-Humid"]
[null,"RichmondVA","Richmond","VA",51,159,4,"A","Mixed-Humid"]
[null,"Richmond (city)VA","Richmond (city)","VA",51,760,4,"A","Mixed-Humid"]
[null,"RoanokeVA","Roanoke","VA",51,161,4,"A","Mixed-Humid"]
[null,"Roanoke (city)VA","Roanoke (city)","VA",51,770,4,"A","Mixed-Humid"]
[null,"RockbridgeVA","Rockbridge","VA",51,163,4,"A","Mixed-Humid"]
[null,"RockinghamVA","Rockingham","VA",51,165,4,"A","Mixed-Humid"]
[null,"RussellVA","Russell","VA",51,167,4,"A","Mixed-Humid"]
[null,"Salem (city)VA","Salem (city)","VA",51,775,4,"A","Mixed-Humid"]
[null,"ScottVA","Scott","VA",51,169,4,"A","Mixed-Humid"]
[null,{"$f":"CONCATENATE(C3012,D3012)","v":"ShenandoahVA"},"Shenandoah","VA",51,171,4,"A","Mixed-Humid"]
[null,"SmythVA","Smyth","VA",51,173,4,"A","Mixed-Humid"]
[null,"SouthamptonVA","Southampton","VA",51,175,4,"A","Mixed-Humid"]
[null,"SpotsylvaniaVA","Spotsylvania","VA",51,177,4,"A","Mixed-Humid"]
[null,"StaffordVA","Stafford","VA",51,179,4,"A","Mixed-Humid"]
[null,"Staunton (city)VA","Staunton (city)","VA",51,790,4,"A","Mixed-Humid"]
[null,"Suffolk (city)VA","Suffolk (city)","VA",51,800,4,"A","Mixed-Humid"]
[null,"SurryVA","Surry","VA",51,181,4,"A","Mixed-Humid"]
[null,"SussexVA","Sussex","VA",51,183,4,"A","Mixed-Humid"]
[null,"TazewellVA","Tazewell","VA",51,185,4,"A","Mixed-Humid"]
[null,"Virginia Beach (city)VA","Virginia Beach (city)","VA",51,810,4,"A","Mixed-Humid"]
[null,"WarrenVA","Warren","VA",51,187,4,"A","Mixed-Humid"]
[null,"WashingtonVA","Washington","VA",51,191,4,"A","Mixed-Humid"]
[null,"Waynesboro (city)VA","Waynesboro (city)","VA",51,820,4,"A","Mixed-Humid"]
[null,"WestmorelandVA","Westmoreland","VA",51,193,4,"A","Mixed-Humid"]
[null,"Williamsburg (city)VA","Williamsburg (city)","VA",51,830,4,"A","Mixed-Humid"]
[null,"Winchester (city)VA","Winchester (city)","VA",51,840,4,"A","Mixed-Humid"]
[null,"WiseVA","Wise","VA",51,195,4,"A","Mixed-Humid"]
[null,"WytheVA","Wythe","VA",51,197,4,"A","Mixed-Humid"]
[null,"YorkVA","York","VA",51,199,4,"A","Mixed-Humid"]
[null,"St. Croix IslandVI","St. Croix Island","VI",78,10,1,"A","Hot-Humid"]
[null,"St. John IslandVI","St. John Island","VI",78,20,1,"A","Hot-Humid"]
[null,"St. Thomas IslandVI","St. Thomas Island","VI",78,30,1,"A","Hot-Humid"]
[null,"AddisonVT","Addison","VT",50,1,6,"A","Cold"]
[null,"BenningtonVT","Bennington","VT",50,3,6,"A","Cold"]
[null,"CaledoniaVT","Caledonia","VT",50,5,6,"A","Cold"]
[null,"ChittendenVT","Chittenden","VT",50,7,6,"A","Cold"]
[null,"EssexVT","Essex","VT",50,9,6,"A","Cold"]
[null,"FranklinVT","Franklin","VT",50,11,6,"A","Cold"]
[null,"Grand IsleVT","Grand Isle","VT",50,13,6,"A","Cold"]
[null,"LamoilleVT","Lamoille","VT",50,15,6,"A","Cold"]
[null,"OrangeVT","Orange","VT",50,17,6,"A","Cold"]
[null,"OrleansVT","Orleans","VT",50,19,6,"A","Cold"]
[null,"RutlandVT","Rutland","VT",50,21,6,"A","Cold"]
[null,"WashingtonVT","Washington","VT",50,23,6,"A","Cold"]
[null,"WindhamVT","Windham","VT",50,25,6,"A","Cold"]
[null,"WindsorVT","Windsor","VT",50,27,6,"A","Cold"]
[null,"AdamsWA","Adams","WA",53,1,5,"B","Cold"]
[null,"AsotinWA","Asotin","WA",53,3,5,"B","Cold"]
[null,"BentonWA","Benton","WA",53,5,5,"B","Cold"]
[null,"ChelanWA","Chelan","WA",53,7,5,"B","Cold"]
[null,"ClallamWA","Clallam","WA",53,9,4,"C","Marine"]
[null,"ClarkWA","Clark","WA",53,11,4,"C","Marine"]
[null,"ColumbiaWA","Columbia","WA",53,13,5,"B","Cold"]
[null,"CowlitzWA","Cowlitz","WA",53,15,4,"C","Marine"]
[null,"DouglasWA","Douglas","WA",53,17,5,"B","Cold"]
[null,"FerryWA","Ferry","WA",53,19,6,"B","Cold"]
[null,"FranklinWA","Franklin","WA",53,21,5,"B","Cold"]
[null,"GarfieldWA","Garfield","WA",53,23,5,"B","Cold"]
[null,"GrantWA","Grant","WA",53,25,5,"B","Cold"]
[null,"Grays HarborWA","Grays Harbor","WA",53,27,4,"C","Marine"]
[null,"IslandWA","Island","WA",53,29,4,"C","Marine"]
[null,"JeffersonWA","Jefferson","WA",53,31,4,"C","Marine"]
[null,"KingWA","King","WA",53,33,4,"C","Marine"]
[null,"KitsapWA","Kitsap","WA",53,35,4,"C","Marine"]
[null,"KittitasWA","Kittitas","WA",53,37,5,"B","Cold"]
[null,"KlickitatWA","Klickitat","WA",53,39,5,"B","Cold"]
[null,"LewisWA","Lewis","WA",53,41,4,"C","Marine"]
[null,"LincolnWA","Lincoln","WA",53,43,5,"B","Cold"]
[null,"MasonWA","Mason","WA",53,45,4,"C","Marine"]
[null,"OkanoganWA","Okanogan","WA",53,47,6,"B","Cold"]
[null,"PacificWA","Pacific","WA",53,49,4,"C","Marine"]
[null,"Pend OreilleWA","Pend Oreille","WA",53,51,6,"B","Cold"]
[null,"PierceWA","Pierce","WA",53,53,4,"C","Marine"]
[null,{"$f":"CONCATENATE(C3076,D3076)","v":"San JuanWA"},"San Juan","WA",53,55,4,"C","Marine"]
[null,"SkagitWA","Skagit","WA",53,57,4,"C","Marine"]
[null,"SkamaniaWA","Skamania","WA",53,59,5,"B","Cold"]
[null,"SnohomishWA","Snohomish","WA",53,61,4,"C","Marine"]
[null,"SpokaneWA","Spokane","WA",53,63,5,"B","Cold"]
[null,"StevensWA","Stevens","WA",53,65,6,"B","Cold"]
[null,"ThurstonWA","Thurston","WA",53,67,4,"C","Marine"]
[null,"WahkiakumWA","Wahkiakum","WA",53,69,4,"C","Marine"]
[null,"Walla WallaWA","Walla Walla","WA",53,71,5,"B","Cold"]
[null,"WhatcomWA","Whatcom","WA",53,73,4,"C","Marine"]
[null,"WhitmanWA","Whitman","WA",53,75,5,"B","Cold"]
[null,"YakimaWA","Yakima","WA",53,77,5,"B","Cold"]
[null,"AdamsWI","Adams","WI",55,1,6,"A","Cold"]
[null,"AshlandWI","Ashland","WI",55,3,7,"N/A","Very Cold"]
[null,"BarronWI","Barron","WI",55,5,6,"A","Cold"]
[null,"BayfieldWI","Bayfield","WI",55,7,7,"N/A","Very Cold"]
[null,"BrownWI","Brown","WI",55,9,6,"A","Cold"]
[null,"BuffaloWI","Buffalo","WI",55,11,6,"A","Cold"]
[null,"BurnettWI","Burnett","WI",55,13,7,"N/A","Very Cold"]
[null,"CalumetWI","Calumet","WI",55,15,6,"A","Cold"]
[null,"ChippewaWI","Chippewa","WI",55,17,6,"A","Cold"]
[null,"ClarkWI","Clark","WI",55,19,6,"A","Cold"]
[null,"ColumbiaWI","Columbia","WI",55,21,6,"A","Cold"]
[null,"CrawfordWI","Crawford","WI",55,23,6,"A","Cold"]
[null,"DaneWI","Dane","WI",55,25,6,"A","Cold"]
[null,"DodgeWI","Dodge","WI",55,27,6,"A","Cold"]
[null,"DoorWI","Door","WI",55,29,6,"A","Cold"]
[null,"DouglasWI","Douglas","WI",55,31,7,"N/A","Very Cold"]
[null,"DunnWI","Dunn","WI",55,33,6,"A","Cold"]
[null,"Eau ClaireWI","Eau Claire","WI",55,35,6,"A","Cold"]
[null,"FlorenceWI","Florence","WI",55,37,7,"N/A","Very Cold"]
[null,"Fond du LacWI","Fond du Lac","WI",55,39,6,"A","Cold"]
[null,"ForestWI","Forest","WI",55,41,7,"N/A","Very Cold"]
[null,"GrantWI","Grant","WI",55,43,6,"A","Cold"]
[null,"GreenWI","Green","WI",55,45,6,"A","Cold"]
[null,"Green LakeWI","Green Lake","WI",55,47,6,"A","Cold"]
[null,"IowaWI","Iowa","WI",55,49,6,"A","Cold"]
[null,"IronWI","Iron","WI",55,51,7,"N/A","Very Cold"]
[null,"JacksonWI","Jackson","WI",55,53,6,"A","Cold"]
[null,"JeffersonWI","Jefferson","WI",55,55,6,"A","Cold"]
[null,"JuneauWI","Juneau","WI",55,57,6,"A","Cold"]
[null,"KenoshaWI","Kenosha","WI",55,59,6,"A","Cold"]
[null,"KewauneeWI","Kewaunee","WI",55,61,6,"A","Cold"]
[null,"La CrosseWI","La Crosse","WI",55,63,6,"A","Cold"]
[null,"LafayetteWI","Lafayette","WI",55,65,6,"A","Cold"]
[null,"LangladeWI","Langlade","WI",55,67,7,"N/A","Very Cold"]
[null,"LincolnWI","Lincoln","WI",55,69,7,"N/A","Very Cold"]
[null,"ManitowocWI","Manitowoc","WI",55,71,6,"A","Cold"]
[null,"MarathonWI","Marathon","WI",55,73,6,"A","Cold"]
[null,"MarinetteWI","Marinette","WI",55,75,6,"A","Cold"]
[null,"MarquetteWI","Marquette","WI",55,77,6,"A","Cold"]
[null,"MenomineeWI","Menominee","WI",55,78,6,"A","Cold"]
[null,"MilwaukeeWI","Milwaukee","WI",55,79,6,"A","Cold"]
[null,"MonroeWI","Monroe","WI",55,81,6,"A","Cold"]
[null,"OcontoWI","Oconto","WI",55,83,6,"A","Cold"]
[null,"OneidaWI","Oneida","WI",55,85,7,"N/A","Very Cold"]
[null,"OutagamieWI","Outagamie","WI",55,87,6,"A","Cold"]
[null,"OzaukeeWI","Ozaukee","WI",55,89,6,"A","Cold"]
[null,"PepinWI","Pepin","WI",55,91,6,"A","Cold"]
[null,"PierceWI","Pierce","WI",55,93,6,"A","Cold"]
[null,"PolkWI","Polk","WI",55,95,6,"A","Cold"]
[null,"PortageWI","Portage","WI",55,97,6,"A","Cold"]
[null,"PriceWI","Price","WI",55,99,7,"N/A","Very Cold"]
[null,"RacineWI","Racine","WI",55,101,6,"A","Cold"]
[null,{"$f":"CONCATENATE(C3140,D3140)","v":"RichlandWI"},"Richland","WI",55,103,6,"A","Cold"]
[null,"RockWI","Rock","WI",55,105,6,"A","Cold"]
[null,"RuskWI","Rusk","WI",55,107,6,"A","Cold"]
[null,"SaukWI","Sauk","WI",55,111,6,"A","Cold"]
[null,"SawyerWI","Sawyer","WI",55,113,7,"N/A","Very Cold"]
[null,"ShawanoWI","Shawano","WI",55,115,6,"A","Cold"]
[null,"SheboyganWI","Sheboygan","WI",55,117,6,"A","Cold"]
[null,"St. CroixWI","St. Croix","WI",55,109,6,"A","Cold"]
[null,"TaylorWI","Taylor","WI",55,119,7,"N/A","Very Cold"]
[null,"TrempealeauWI","Trempealeau","WI",55,121,6,"A","Cold"]
[null,"VernonWI","Vernon","WI",55,123,6,"A","Cold"]
[null,"VilasWI","Vilas","WI",55,125,7,"N/A","Very Cold"]
[null,"WalworthWI","Walworth","WI",55,127,6,"A","Cold"]
[null,"WashburnWI","Washburn","WI",55,129,7,"N/A","Very Cold"]
[null,"WashingtonWI","Washington","WI",55,131,6,"A","Cold"]
[null,"WaukeshaWI","Waukesha","WI",55,133,6,"A","Cold"]
[null,"WaupacaWI","Waupaca","WI",55,135,6,"A","Cold"]
[null,"WausharaWI","Waushara","WI",55,137,6,"A","Cold"]
[null,"WinnebagoWI","Winnebago","WI",55,139,6,"A","Cold"]
[null,"WoodWI","Wood","WI",55,141,6,"A","Cold"]
[null,"BarbourWV","Barbour","WV",54,1,5,"A","Cold"]
[null,"BerkeleyWV","Berkeley","WV",54,3,4,"A","Mixed-Humid"]
[null,"BooneWV","Boone","WV",54,5,4,"A","Mixed-Humid"]
[null,"BraxtonWV","Braxton","WV",54,7,4,"A","Mixed-Humid"]
[null,"BrookeWV","Brooke","WV",54,9,5,"A","Cold"]
[null,"CabellWV","Cabell","WV",54,11,4,"A","Mixed-Humid"]
[null,"CalhounWV","Calhoun","WV",54,13,4,"A","Mixed-Humid"]
[null,"ClayWV","Clay","WV",54,15,4,"A","Mixed-Humid"]
[null,"DoddridgeWV","Doddridge","WV",54,17,5,"A","Cold"]
[null,"FayetteWV","Fayette","WV",54,19,5,"A","Cold"]
[null,"GilmerWV","Gilmer","WV",54,21,4,"A","Mixed-Humid"]
[null,"GrantWV","Grant","WV",54,23,5,"A","Cold"]
[null,"GreenbrierWV","Greenbrier","WV",54,25,5,"A","Cold"]
[null,"HampshireWV","Hampshire","WV",54,27,5,"A","Cold"]
[null,"HancockWV","Hancock","WV",54,29,5,"A","Cold"]
[null,"HardyWV","Hardy","WV",54,31,5,"A","Cold"]
[null,"HarrisonWV","Harrison","WV",54,33,5,"A","Cold"]
[null,"JacksonWV","Jackson","WV",54,35,4,"A","Mixed-Humid"]
[null,"JeffersonWV","Jefferson","WV",54,37,4,"A","Mixed-Humid"]
[null,"KanawhaWV","Kanawha","WV",54,39,4,"A","Mixed-Humid"]
[null,"LewisWV","Lewis","WV",54,41,5,"A","Cold"]
[null,"LincolnWV","Lincoln","WV",54,43,4,"A","Mixed-Humid"]
[null,"LoganWV","Logan","WV",54,45,4,"A","Mixed-Humid"]
[null,"MarionWV","Marion","WV",54,49,5,"A","Cold"]
[null,"MarshallWV","Marshall","WV",54,51,5,"A","Cold"]
[null,"MasonWV","Mason","WV",54,53,4,"A","Mixed-Humid"]
[null,"McDowellWV","McDowell","WV",54,47,4,"A","Mixed-Humid"]
[null,"MercerWV","Mercer","WV",54,55,4,"A","Mixed-Humid"]
[null,"MineralWV","Mineral","WV",54,57,5,"A","Cold"]
[null,"MingoWV","Mingo","WV",54,59,4,"A","Mixed-Humid"]
[null,"MonongaliaWV","Monongalia","WV",54,61,5,"A","Cold"]
[null,"MonroeWV","Monroe","WV",54,63,4,"A","Mixed-Humid"]
[null,"MorganWV","Morgan","WV",54,65,4,"A","Mixed-Humid"]
[null,"NicholasWV","Nicholas","WV",54,67,5,"A","Cold"]
[null,"OhioWV","Ohio","WV",54,69,5,"A","Cold"]
[null,"PendletonWV","Pendleton","WV",54,71,5,"A","Cold"]
[null,"PleasantsWV","Pleasants","WV",54,73,4,"A","Mixed-Humid"]
[null,"PocahontasWV","Pocahontas","WV",54,75,5,"A","Cold"]
[null,"PrestonWV","Preston","WV",54,77,5,"A","Cold"]
[null,"PutnamWV","Putnam","WV",54,79,4,"A","Mixed-Humid"]
[null,"RaleighWV","Raleigh","WV",54,81,5,"A","Cold"]
[null,"RandolphWV","Randolph","WV",54,83,5,"A","Cold"]
[null,"RitchieWV","Ritchie","WV",54,85,4,"A","Mixed-Humid"]
[null,"RoaneWV","Roane","WV",54,87,4,"A","Mixed-Humid"]
[null,{"$f":"CONCATENATE(C3204,D3204)","v":"SummersWV"},"Summers","WV",54,89,5,"A","Cold"]
[null,"TaylorWV","Taylor","WV",54,91,5,"A","Cold"]
[null,"TuckerWV","Tucker","WV",54,93,5,"A","Cold"]
[null,"TylerWV","Tyler","WV",54,95,4,"A","Mixed-Humid"]
[null,"UpshurWV","Upshur","WV",54,97,5,"A","Cold"]
[null,"WayneWV","Wayne","WV",54,99,4,"A","Mixed-Humid"]
[null,"WebsterWV","Webster","WV",54,101,5,"A","Cold"]
[null,"WetzelWV","Wetzel","WV",54,103,5,"A","Cold"]
[null,"WirtWV","Wirt","WV",54,105,4,"A","Mixed-Humid"]
[null,"WoodWV","Wood","WV",54,107,4,"A","Mixed-Humid"]
[null,"WyomingWV","Wyoming","WV",54,109,4,"A","Mixed-Humid"]
[null,"AlbanyWY","Albany","WY",56,1,6,"B","Cold"]
[null,"Big HornWY","Big Horn","WY",56,3,6,"B","Cold"]
[null,"CampbellWY","Campbell","WY",56,5,6,"B","Cold"]
[null,"CarbonWY","Carbon","WY",56,7,6,"B","Cold"]
[null,"ConverseWY","Converse","WY",56,9,6,"B","Cold"]
[null,"CrookWY","Crook","WY",56,11,6,"B","Cold"]
[null,"FremontWY","Fremont","WY",56,13,6,"B","Cold"]
[null,"GoshenWY","Goshen","WY",56,15,5,"B","Cold"]
[null,"Hot SpringsWY","Hot Springs","WY",56,17,6,"B","Cold"]
[null,"JohnsonWY","Johnson","WY",56,19,6,"B","Cold"]
[null,"LaramieWY","Laramie","WY",56,21,6,"B","Cold"]
[null,"LincolnWY","Lincoln","WY",56,23,7,"N/A","Very Cold"]
[null,"NatronaWY","Natrona","WY",56,25,6,"B","Cold"]
[null,"NiobraraWY","Niobrara","WY",56,27,6,"B","Cold"]
[null,"ParkWY","Park","WY",56,29,6,"B","Cold"]
[null,"PlatteWY","Platte","WY",56,31,5,"B","Cold"]
[null,"SheridanWY","Sheridan","WY",56,33,6,"B","Cold"]
[null,"SubletteWY","Sublette","WY",56,35,7,"N/A","Very Cold"]
[null,"SweetwaterWY","Sweetwater","WY",56,37,6,"B","Cold"]
[null,"TetonWY","Teton","WY",56,39,7,"N/A","Very Cold"]
[null,"UintaWY","Uinta","WY",56,41,6,"B","Cold"]
[null,"WashakieWY","Washakie","WY",56,43,6,"B","Cold"]
[null,"WestonWY","Weston","WY",56,45,6,"B","Cold"]

{"sheet":"Store Data","index":17,"n_rows":14,"n_cols":64,"rows_kept":14,"cut":false,"hidden":false,"merged":[[6,49,6,53],[6,54,6,58],[6,59,6,63],[6,24,6,28],[6,29,6,33],[6,34,6,38],[6,39,6,43],[6,44,6,48]]}
[]
[]
[]
[]
[]
[]
["(2) Store No.",null,"Survey Due Date","(8) Construction Start Date (CSD)",null,"(3) Location Name","(4) SOW","(14) Prototype","(23) Region","TAB Partner","Street Address","City","State","COUNTY","(27) Operator","SR Program Lead (SRPL)","SR Development Manager (DM)","SR Construction Manager (CM)","SR Program Manager (SRP)","FEQ Field Consultant","(37) Architect","Open Date","Location Phone","Location Email","AC1",null,null,null,null,"AC2",null,null,null,null,"AC3",null,null,null,null,"AC4",null,null,null,null,"AC5",null,null,null,null,"AC6",null,null,null,null,"AC7",null,null,null,null,"AC8"]
[1,null,null,null,null,"Northeast",null,null,null,null,null,null,null,null,null,null,null,null,null,null,null,null,null,null,"Serial #","Model #","Mfg Date","Age","Type","Serial #","Model #","Mfg Date","Age","Type","Serial #","Model #","Mfg Date","Age","Type","Serial #","Model #","Mfg Date","Age","Type","Serial #","Model #","Mfg Date","Age","Type","Serial #","Model #","Mfg Date","Age","Type","Serial #","Model #","Mfg Date","Age","Type","Serial #","Model #","Mfg Date","Age","Type"]
[]
[2233,{"$f":"D10-195","v":"2025-10-12"},{"$f":"D10-165","v":"2025-11-11"},"2026-04-25","FULL TAB w FM","Bristow FSU","Centerline 3.0, Brand Image, Drive-Thru Modification, JLOP Dual, F@F Dual, OMD Single, Drive-Thru Door, MLv1 Conversion, Parallel Drive Thru Cockpit, Side Dining Conversion, Signage","S06E-R","Atlantic",{"$f":"IF(H10=\"DTO\",\"QTAB\",IF(MID(H10,1,2)=\"IN\",\"QTAB\",IF(MID(H10,1,6)=\"CUSTOM\",\"QTAB\",IF(MID(I10,1,3)=\"Nor\",\"National TAB\",IF(MID(I10,1,3)=\"Atl\",\"National TAB\",IF(MID(I10,1,3)=\"Mid\",\"National TAB\",IF(MID(I10,4,4)=\"thea\",\"National TAB\",IF(I10=\"WEST\",\"UTAB\",IF(MID(I10,1,5)=\"SOUTH\",\"UTAB\",\"\")))))))))","v":"National TAB"},"9939 Sowder Village Sq","Manassas","VA","Manassas","Jeremy Smith","Chad Baker","Kayla Britton","Ken Misso","Andrew Turner","Keith Nelson",null,"2009-04-02",7033659292,"02233@chick-fil-a.com","05621J05571","LGH180H4BH4Y","2021-09-01",{"$f":"(TODAY()-AA10)/365","v":4.3123287671232875},{"$f":"IF(ISBLANK(Y10),\"NODATA\",IF(MID(Z10,1,2)=\"RN\",\"AAON\",IF(LEN(Z10)>15,\"WeatherMaker\",IF(VALUE(MID(Y10,3,2))>9,\"ENER\",IF(VALUE(MID(Y10,3,2))<10,\"L-SER\")))))","v":"ENER"},"5609A00420","LGA102H2BH4Y","2009-01-01",{"$f":"(TODAY()-AF10)/365","v":16.986301369863014},{"$f":"IF(ISBLANK(AD10),\"NODATA\",IF(MID(AE10,1,2)=\"RN\",\"AAON\",IF(LEN(AE10)>15,\"WeatherMaker\",IF(VALUE(MID(AD10,3,2))>9,\"ENER\",IF(VALUE(MID(AD10,3,2))<10,\"L-SER\")))))","v":"L-SER"},"5622H07235","LGH150H4BH2Y","2022-08-01",{"$f":"(TODAY()-AK10)/365","v":3.3972602739726026},{"$f":"IF(ISBLANK(AI10),\"NODATA\",IF(LEN(AJ10)>15,\"WeatherMaker\",IF(VALUE(MID(AI10,3,2))>9,\"ENER\",IF(VALUE(MID(AI10,3,2))<10,\"L-SER\"))))","v":"ENER"},"5609A ","LGH060",null,{"$f":"(TODAY()-AP10)/365","v":126.06575342465753},{"$f":"IF(ISBLANK(AN10),\"NODATA\",IF(LEN(AO10)>15,\"WeatherMaker\",IF(VALUE(MID(AN10,3,2))>9,\"ENER\",IF(VALUE(MID(AN10,3,2))<10,\"L-SER\"))))","v":"L-SER"}]
[]
[null,null,null,null,null,null,null,null,null,null,null,null,null,null,null,null,null,null,null,null,null,null,null,null,null,"LGH180H4BH1Y",null,null,null,null,"LGH060H4ET1Y"]
[null,null,null,null,null,null,null,null,null,null,null,null,null,null,null,null,null,null,null,null,null,null,null,null,null,null,null,null,null,null,null,null,null,null,null,"LGH YHD"]
[null,null,null,null,null,null,null,null,null,null,null,null,null,null,null,null,null,null,null,null,null,null,null,null,null,null,null,null,null,null,null,null,null,null,null,null,null,null,null,null,null,null,null,null,null,null,null,null,null,"5614G02828","LCH120H4BN3Y","2014-07-01"]

{"sheet":"Drop Menus","index":18,"n_rows":15,"n_cols":8,"rows_kept":15,"cut":false,"hidden":true,"merged":[[1,0,2,0],[1,1,2,1]]}
[]
["DEVICE","GAS PIPE SIZE","CONDENSATION","DROP","YES/NO","YES/NO/M"]
[null,null,"PIPE SIZE"]
["WH","1/2\"",0,"D1","YES","YES ","I","NW"]
["RTU 1","3/4\"",0.75,"D2","NO","NO","D","RS"]
["RTU 2","1\"",1,"D3","N/A","M","NO","NO"]
["RTU 3","1-1/4\"",1.25,"D4",null,"N/A","N/A"]
["RTU 4","1-1/2\"",1.5,"D5","SINGLE/DOUBLE","YES/NO/D"]
["RTU 5","2\"",null,"D6"]
["RTU 6","2-1/2\"",null,"D7","S","YES","D","YES"]
["RTU 7","3\"",null,"D8","D","NO","ND","NO"]
["RTU 8 ","3-1/2\"",null,"D9","N/A","D","N/A","MG"]
["SLOC","4\"",null,null,null,"N/A"]
["DLOC"]
["OMDC"]